program: Gaussian 09
title: 000285345
version: EM64L-G09RevD.01
frameworkgroup: C1[X(C20H23NO5)]
method: RPBEPBE
basis: SDD
operation: Freq
keyword: #p
keyword: freq=noraman
keyword: PBEPBE/SDD
title: #p freq=noraman PBEPBE/SDD
converged: YES YES NO NO
title: Mulliken charges:
elementType: O O O O O N C C C C C C C C C C C C C C C C C C C C H H H H H H H H H H H H H H H H H H H H H H H
charge: -0.275445 -0.251063 -0.271180 -0.268072 -0.251445 -0.167153 0.380599 -0.483507 -0.529795 -0.259437 -0.369261 -0.498470 -0.431271 0.532804 -0.369749 0.307738 -0.663270 0.422385 -0.615200 -0.578588 0.180681 0.174556 0.306132 -0.519639 -0.204062 -0.765178 0.267602 0.230767 0.234743 0.298734 0.218579 0.186752 0.228808 0.227277 0.264660 0.197156 0.209257 0.232172 0.233650 0.257160 0.257011 0.249726 0.223931 0.233417 0.228610 0.238525 0.253048 0.249665 0.245638
chargesum: 0.00000
title: Mulliken charges with hydrogens summed into heavy atoms:
elementType: O O O O O N C C C C C C C C C C C C C C C C C C C C
charge: -0.275445 -0.251063 -0.271180 -0.268072 -0.251445 -0.167153 0.380599 -0.215905 -0.064285 0.039297 0.036071 -0.042385 -0.166610 0.532804 0.036664 0.307738 -0.197448 0.422385 -0.358041 -0.321577 0.180681 0.174556 0.306132 0.187435 0.263073 -0.016828
polarizability: 2.70576011e+02 9.01833133e+00 2.41853142e+02 -4.32523821e+00 -5.64857823e+00 1.97586600e+02
1716.lowfreq: -11.3705 -9.6947 -0.0007 -0.0006 -0.0003 5.0379 20.6030 31.1230 34.9464
frequency: 19.4486 31.0921 34.7984 43.0359 59.1947 67.9184 73.6071 79.3104 81.8855 106.4360 116.0190 133.8614 178.0960 189.0247 193.8253 209.4910 213.6369 223.1348 239.4255 247.2818 284.0740 304.4495 314.9838 353.0122 372.8599 380.5898 415.9315 432.4055 445.7069 459.2927 475.3925 515.8742 530.5410 558.0857 578.9698 594.5074 614.0678 634.8679 652.9988 670.8880 678.0938 684.2360 718.3475 736.3705 752.6654 776.6861 810.4394 834.5456 838.5238 841.1046 849.0451 866.0779 869.8409 878.7938 880.6532 884.3255 914.5225 923.1671 946.0035 968.2700 973.9107 985.1553 996.8218 1012.1060 1016.8190 1033.9435 1041.4127 1049.0505 1066.4579 1069.6866 1082.2459 1109.3672 1114.2005 1126.8782 1132.6137 1151.1122 1163.4285 1169.1281 1183.3068 1185.8607 1189.7639 1195.1970 1214.4560 1215.5786 1222.8796 1237.6593 1240.0637 1256.2065 1275.8762 1282.1888 1296.2997 1300.4157 1310.8961 1318.8672 1325.8368 1333.9775 1340.8951 1360.6929 1383.1808 1384.5681 1408.4216 1429.3978 1445.0926 1453.8189 1454.3974 1457.4014 1470.1171 1471.9368 1475.3640 1478.5033 1481.9337 1486.9402 1491.0416 1504.3286 1618.5617 1622.5611 1642.0110 1651.6628 2849.7060 2876.4821 2977.4376 2986.3590 2988.9524 2992.1211 2999.3442 3004.7385 3005.7274 3014.2539 3015.7087 3027.0298 3055.6911 3066.3957 3075.4574 3082.4424 3097.9011 3103.0814 3123.2061 3138.6753 3155.9682 3161.4606 3168.6797
redmass: 2.6119 5.3675 2.9650 1.0316 4.2774 5.0121 3.0983 2.9490 4.2895 4.2486 3.7131 3.4443 4.1651 3.5488 3.5115 2.1330 2.3723 2.5152 5.1930 4.9312 5.0219 3.8751 3.1959 3.9347 5.5116 3.6093 4.1706 3.8156 4.0915 3.6625 4.5512 3.6383 4.6249 3.5304 3.9840 4.3907 5.1771 3.5608 3.4245 6.4259 6.6536 3.6866 5.4983 4.9208 3.1070 6.4117 1.8908 4.9916 3.2541 1.8819 3.4358 1.6009 1.5572 2.2469 2.0752 2.2091 7.3160 2.6956 3.1374 3.2710 5.0227 2.3946 2.0148 2.1747 3.2249 2.9194 1.6918 2.0410 3.2198 1.5039 3.2976 1.7061 1.7402 1.0675 1.8153 1.4288 1.5268 3.3913 1.9175 1.4967 1.8214 3.2644 1.5825 1.3678 1.6760 1.7769 1.3654 1.4322 1.7736 1.7623 1.5410 1.3882 1.4267 1.5553 1.9498 1.4502 1.5829 1.2791 1.4469 1.2393 5.1877 4.7110 1.1555 1.0589 1.0542 1.0868 1.0562 1.3233 1.2906 1.0504 1.0881 1.7202 1.1113 1.0880 7.8287 9.5073 9.2960 8.4682 1.0708 1.0720 1.0315 1.0892 1.0868 1.0615 1.0619 1.0383 1.0613 1.0658 1.0808 1.0849 1.1009 1.1007 1.1044 1.1048 1.0940 1.1096 1.1018 1.1025 1.0925 1.0928 1.0949
irintensity: 0.4880 0.8170 0.5899 0.3070 2.6357 3.4991 6.5306 8.0032 2.6388 1.6297 2.5069 1.9461 2.8965 1.3320 4.0650 4.5427 1.1293 1.9267 0.9451 2.4062 1.4084 4.6609 2.1236 4.1760 0.5632 0.8905 4.5748 7.8822 5.3203 5.5974 8.1816 8.8255 4.8814 5.6475 16.0820 3.8203 14.9764 1.7010 1.3222 2.6695 0.2180 3.3921 3.1863 9.4030 2.6799 16.5521 1.4770 23.1822 2.2333 42.0115 5.2585 10.9148 26.8110 11.4215 43.5839 1.6973 110.9147 2.3010 7.7218 61.8479 86.5316 36.8201 65.1449 9.3647 3.1693 12.7262 6.4526 10.0733 9.6901 9.7406 16.0276 67.4813 34.5289 1.2286 10.1264 3.6275 42.0406 24.7340 20.2595 79.0501 41.2674 286.6772 39.3613 36.2671 10.8468 124.9880 1.5766 19.7907 65.8953 10.0773 37.0935 3.7986 30.6939 18.2185 42.6669 32.3021 21.9893 0.5593 13.1629 52.7347 1.1474 2.5352 0.4340 21.9278 16.6667 6.7070 18.6715 56.1013 70.5239 34.6384 6.1908 79.1532 13.9576 2.3638 2.7191 5.2093 110.9237 184.2925 97.5931 145.8054 68.5315 49.3747 25.1501 151.5412 18.3676 2.3102 34.1652 41.6093 15.7968 18.4457 32.2363 17.3961 32.5257 49.6839 8.6775 33.3569 26.8901 8.5926 5.9495 2.3076 8.2417
temp: 298.150 k
press: 1.00000 atm
elementType: 8 8 8 8 8 7 6 6 6 6 6 6 6 6 6 6 6 6 6 6 6 6 6 6 6 6 1 1 1 1 1 1 1 1 1 1 1 1 1 1 1 1 1 1 1 1 1 1 1
symmnumber: 1
zpe: 1035613.5 jmol-1
zpe.correction: 0.394444 hartree
zpe.thermalcorrener: 0.418606 hartree
zpe.thermalcorrenthalpy: 0.419550 hartree
zpe.thermalcorrgfe: 0.338781 hartree
zpe.sumelectzpe: -1204.805631 hartree
zpe.sumelectthermal: -1204.781469 hartree
zpe.sumelectthermalent: -1204.780525 hartree
zpe.sumelectthermalfe: -1204.861294 hartree
dipole: 0.6669 0.3488 1.5016
dipole: 1.6796
quadrupole: -144.1191 -144.7060 -149.5773
quadrupole: -5.5717 -0.9193 -7.0971
quadrupole: 2.0150 1.4282 -3.4432 -5.5717 -0.9193 -7.0971
hfenergy: -1205.2000753 hartree
pointgroup: C01 [X(C20H23N1O5)]
dipole: -0.3075358 0.026253 0.5842991 debye
polarizability: 272.7746386|-0.0405257|239.6218494|7.9429281|-1.4969713|197.6192656 unknown
InChI: InChI=1S/C20H23NO5/c1-12(22)26-19-17(23-2)10-20-5-3-6-21(20)7-4-13-8-15-16(25-11-24-15)9-14(13)18(19)20/h8-10,18-19H,3-7,11H2,1-2H3
charge 0 multiplicity 1
49 atoms
O  -1.318384 2.432863 0.411048
O  -3.672826 1.239913 -1.350709
O  4.382099 0.071177 1.335813
O  4.839492 -1.131111 -0.691781
O  -0.19898 3.548276 -1.316917
N  -1.141091 -2.440046 0.172518
C  -1.650212 -1.139747 0.704538
C  -0.619994 0.062052 0.567882
C  -1.885585 -1.530988 2.191667
C  -1.290419 1.129598 -0.357608
C  -1.87221 -3.560899 0.820247
C  -2.462679 -2.967267 2.133656
C  -2.899854 -0.602098 0.013034
C  0.801909 -0.316218 0.179969
C  -0.917469 -2.624689 -1.268787
C  -2.70126 0.610213 -0.571684
C  -0.070768 -1.492183 -1.911139
C  1.075499 -1.035262 -1.023162
C  1.867467 0.080816 1.037424
C  2.41375 -1.355861 -1.382769
C  3.170436 -0.253522 0.665318
C  3.438866 -0.957268 -0.522172
C  -0.673671 3.540282 -0.157776
C  -3.445633 2.624525 -1.799225
C  5.437137 -0.660989 0.586341
C  -0.632695 4.687608 0.827486
H  -0.579599 0.5458 1.56084
H  -2.552166 -0.812935 2.699771
H  -0.908081 -1.532117 2.709116
H  -0.735173 1.337963 -1.290639
H  -1.176029 -4.401995 1.008038
H  -2.690628 -3.952901 0.16894
H  -2.187323 -3.560762 3.021654
H  -3.5658 -2.94052 2.082181
H  -3.840408 -1.157185 -0.038502
H  -1.875628 -2.7158 -1.841749
H  -0.380094 -3.587114 -1.385966
H  -0.738963 -0.645969 -2.152788
H  0.316071 -1.860454 -2.878561
H  1.670745 0.63135 1.962094
H  2.632296 -1.90245 -2.304568
H  -2.449406 2.751246 -2.259553
H  -3.559489 3.331577 -0.956947
H  -4.227825 2.809605 -2.550561
H  5.756557 -1.53996 1.178831
H  6.2635 0.031093 0.362334
H  0.259745 4.580206 1.471316
H  -1.520562 4.682638 1.47879
H  -0.552165 5.641803 0.285224
