program: Gaussian 09
title: 000285089
version: EM64L-G09RevD.01
frameworkgroup: C1[X(C24H24N2)]
method: RPBEPBE
basis: SDD
operation: Freq
keyword: #pfreq=noraman
keyword: PBEPBE/SDD
title: #p freq=noraman PBEPBE/SDD
converged: YES YES NO NO
title: Mulliken charges:
elementType: N N C C C C C C C C C C C C C C C C C C C C C C C C H H H H H H H H H H H H H H H H H H H H H H H H
charge: -0.076427 -0.013557 -0.054546 0.341479 0.326744 0.394324 0.173034 -0.364644 -0.341378 -0.384042 -0.375740 -0.396727 -0.381604 -0.689803 -0.682910 -0.677736 -0.267626 -0.255069 -0.258808 -0.254983 -0.228729 -0.228078 -0.152620 -0.250979 -0.244731 -0.247118 0.264886 0.240078 0.258232 0.262508 0.280693 0.257224 0.234808 0.214147 0.220184 0.228758 0.231936 0.204601 0.221972 0.204549 0.229941 0.230572 0.224358 0.225420 0.227057 0.223381 0.223971 0.229844 0.225630 0.227523
chargesum: 0.00000
title: Mulliken charges with hydrogens summed into heavy atoms:
elementType: N N C C C C C C C C C C C C C C C C C C C C C C C C
charge: -0.076427 -0.013557 -0.054546 0.341479 0.326744 0.394324 0.173034 -0.099759 -0.101299 -0.125810 -0.113232 -0.116034 -0.124380 -0.020664 -0.017616 -0.021273 -0.037055 -0.030711 -0.033388 -0.027927 -0.005348 -0.004107 -0.152620 -0.021135 -0.019100 -0.019595
polarizability: 2.95262746e+02 -1.14106024e+01 2.61151449e+02 -5.42307740e+00 2.85356304e+00 2.49049404e+02
1716.lowfreq: -10.5375 -8.0525 -5.9803 -0.0002 0.0004 0.0006 4.1600 11.0865 17.2578
frequency: -9.7370 10.1046 16.5269 34.0640 47.0284 55.8434 69.4036 78.1474 86.2307 94.1813 102.9363 187.7818 192.2183 207.3873 237.5390 255.3769 259.7894 262.1169 272.2683 279.3772 305.5848 322.4513 328.4331 336.8050 376.7245 401.6589 405.5153 410.2518 412.8585 435.2650 465.0625 483.6224 510.4505 525.7998 553.0018 595.3383 615.4697 617.0768 617.5937 630.6898 638.3690 673.0431 695.3651 703.1152 707.4484 711.3571 756.4552 766.2922 775.2114 829.8156 853.7717 859.6894 862.8980 892.8555 901.6830 912.5379 918.0238 921.4784 937.8950 944.0941 951.7891 955.9390 981.5497 985.3662 988.1006 990.1779 990.8959 991.8077 997.9047 998.5824 1000.1108 1027.4686 1029.2729 1030.4173 1030.6488 1031.0596 1079.8825 1087.1747 1090.1874 1151.8137 1169.4817 1172.1065 1172.9863 1179.8782 1189.3174 1191.3500 1193.3324 1196.8122 1202.8042 1233.6853 1238.7116 1308.3139 1318.2408 1325.1227 1372.8186 1374.2745 1375.0907 1378.8581 1379.8996 1399.1619 1414.6274 1429.7800 1433.9667 1437.2474 1449.0368 1461.8737 1465.4990 1473.3792 1475.4749 1476.2104 1479.2487 1480.4375 1493.2850 1585.1391 1590.6901 1591.2671 1606.8269 1607.5595 1611.6131 2179.3570 2977.9412 2983.6565 2988.5780 3078.8075 3080.6027 3084.7987 3090.9665 3092.2447 3097.5791 3120.9687 3121.2180 3121.4476 3129.6779 3130.3409 3131.0874 3142.1268 3143.0184 3144.7076 3152.7158 3153.1242 3157.5466 3164.6809 3165.0518 3169.0444
redmass: 3.1940 3.7279 3.9348 4.3841 4.1626 4.2110 4.3146 4.4379 4.3444 4.2302 4.5005 3.5408 1.0729 4.8168 4.4756 2.1542 1.1241 1.3120 4.5243 4.6236 5.0037 3.3064 2.6986 4.5670 3.8681 2.8340 2.8671 2.9491 2.9936 3.4874 3.5558 3.5587 4.4911 3.9513 6.1817 6.7980 6.3730 6.3711 6.4172 5.4939 6.0401 5.9547 5.3864 1.8844 1.7016 1.7603 1.7417 2.1032 1.9643 2.7823 1.2522 1.2482 1.2476 3.0385 3.7554 1.6525 1.6956 1.7964 1.6839 1.8231 1.2023 3.1236 1.3891 1.4052 1.4829 5.5242 6.1640 4.4126 1.3103 1.3167 1.3263 2.3430 2.1340 1.5784 1.4294 1.7970 1.5861 1.6204 1.6015 3.1833 1.0635 1.0675 1.0560 1.8901 1.6050 1.6726 1.2760 1.1650 3.9789 3.0485 3.0834 1.3704 1.3575 1.3275 6.3583 1.2070 1.2095 8.8533 8.6394 1.3724 5.0727 2.2391 2.2400 2.2521 1.0487 1.0486 1.0470 1.0580 1.0563 2.1764 2.1936 2.1407 1.0712 5.9225 6.2888 6.3162 6.0348 5.9910 6.1150 12.4703 1.0348 1.0345 1.0353 1.1011 1.1002 1.1002 1.0996 1.1006 1.1000 1.0847 1.0844 1.0846 1.0879 1.0878 1.0883 1.0932 1.0928 1.0933 1.0953 1.0953 1.0970 1.1004 1.1005 1.0974
irintensity: 0.1802 0.1667 0.3732 0.2660 0.1698 0.6095 0.2502 2.1642 1.0891 2.0880 0.3566 0.9378 0.1150 0.7607 0.5698 0.0940 0.0706 0.6450 0.2744 0.1171 1.8847 5.0402 6.1443 2.3277 0.9269 0.2891 0.2510 0.0698 0.0539 6.3010 2.3646 2.4328 3.6465 9.8249 48.4473 4.1142 0.2499 0.2743 0.1638 42.1547 33.5007 6.1568 3.6400 36.3326 88.7510 43.1729 41.8176 50.0901 41.0725 1.5244 0.4219 0.1413 0.1872 14.0309 19.6705 0.6967 1.3106 19.2756 0.1117 4.5445 0.0861 40.4998 0.2752 0.4925 0.6427 0.4905 1.1146 0.6057 0.2080 0.1353 0.1920 2.1690 9.8385 8.5171 1.1012 5.8749 1.7290 4.2078 10.7423 4.9408 3.7794 0.5381 0.0537 15.6971 51.1346 116.7403 16.4308 16.4762 43.0037 18.4821 36.7994 2.7019 2.4614 0.5045 0.9477 24.1889 23.4642 0.5252 0.6271 12.8347 1.5857 7.4521 16.3192 11.1740 0.2100 0.7259 0.3160 6.5141 10.6522 27.8193 9.0008 30.2296 11.9776 0.3559 0.3107 1.5118 9.8567 7.6515 4.5992 1337.2888 17.1320 22.1023 30.4335 6.7529 4.3986 26.8498 82.6325 17.9401 48.4806 2.2386 1.4929 0.6145 1.2455 5.9252 11.3354 43.5988 8.8520 31.9164 16.9980 26.5399 27.4721 35.9587 6.2165 13.7008
temp: 298.150 k
press: 1.00000 atm
elementType: 7 7 6 6 6 6 6 6 6 6 6 6 6 6 6 6 6 6 6 6 6 6 6 6 6 6 1 1 1 1 1 1 1 1 1 1 1 1 1 1 1 1 1 1 1 1 1 1 1 1
symmnumber: 1
zpe: 1073566.0 jmol-1
zpe.correction: 0.408900 hartree
zpe.thermalcorrener: 0.432321 hartree
zpe.thermalcorrenthalpy: 0.433265 hartree
zpe.thermalcorrgfe: 0.353845 hartree
zpe.sumelectzpe: -1036.596808 hartree
zpe.sumelectthermal: -1036.573387 hartree
zpe.sumelectthermalent: -1036.572443 hartree
zpe.sumelectthermalfe: -1036.651863 hartree
dipole: -1.3954 -0.8998 1.2252
dipole: 2.0635
quadrupole: -140.3880 -146.1593 -145.4501
quadrupole: 1.9537 0.7022 1.7113
quadrupole: 3.6111 -2.1601 -1.4510 1.9537 0.7022 1.7113
hfenergy: -1037.005708 hartree
pointgroup: C01 [X(C24H24N2)]
dipole: -0.4281361 -0.6576195 0.2081083 debye
polarizability: 299.0805081|2.6083808|255.2879711|-3.4353142|4.1361336|251.0951199 unknown
InChI: InChI=1S/C24H24N2/c1-23(2,3)25-19-26-24(20-13-7-4-8-14-20,21-15-9-5-10-16-21)22-17-11-6-12-18-22/h4-18H,1-3H3
charge 0 multiplicity 1
50 atoms
N  -0.367402 0.566889 -0.904254
N  -2.848346 0.553315 -0.979111
C  0.619408 0.34076 0.199427
C  0.159591 -0.903823 1.007125
C  2.011277 0.128005 -0.455545
C  0.705004 1.628314 1.070637
C  -3.925143 -0.41015 -1.34501
C  -0.939349 -0.793396 1.901781
C  3.162119 -0.030531 0.358351
C  1.058992 1.576406 2.442556
C  0.714774 -2.186026 0.774864
C  2.160957 0.087929 -1.860781
C  0.520287 2.895747 0.463712
C  -3.330107 -1.76679 -1.799022
C  -4.814342 -0.598417 -0.089249
C  -4.745007 0.240424 -2.487318
C  -1.455679 -1.930648 2.557539
C  4.432808 -0.226861 -0.22182
C  1.21665 2.76397 3.191521
C  0.198928 -3.326824 1.431551
C  3.434533 -0.105198 -2.444977
C  0.676609 4.08282 1.211146
C  -1.614152 0.471587 -0.886997
C  -0.886645 -3.205559 2.327555
C  4.576462 -0.264617 -1.629231
C  1.026437 4.023403 2.580045
H  -1.392225 0.187578 2.085926
H  3.070084 0.004425 1.449198
H  1.199302 0.608102 2.935506
H  1.553557 -2.295616 0.080501
H  1.271005 0.215132 -2.483272
H  0.251163 2.943557 -0.596425
H  -2.728398 -2.220696 -0.990502
H  -4.140777 -2.468665 -2.065495
H  -2.682136 -1.634537 -2.684661
H  -5.193508 0.377166 0.261361
H  -4.236154 -1.063143 0.729204
H  -5.675677 -1.249003 -0.326898
H  -4.116268 0.392057 -3.382536
H  -5.597536 -0.407203 -2.761408
H  -5.134032 1.222635 -2.167903
H  -2.29852 -1.821213 3.249595
H  5.310621 -0.346117 0.423404
H  1.486436 2.703294 4.252098
H  0.645573 -4.309213 1.240551
H  3.531991 -0.130612 -3.536465
H  0.526684 5.053574 0.725064
H  -1.284181 -4.08969 2.838582
H  5.564111 -0.412905 -2.080461
H  1.147526 4.944662 3.16094
