program: Gaussian 09
title: 000285027
version: EM64L-G09RevD.01
frameworkgroup: C1[X(C15H11ClN2)]
method: RPBEPBE
basis: SDD
operation: Freq
keyword: #p
keyword: freq=noraman
keyword: PBEPBE/SDD
title: #p freq=noraman PBEPBE/SDD
converged: NO YES NO NO
title: Mulliken charges:
elementType: Cl N N C C C C C C C C C C C C C C C H H H H H H H H H H H
charge: -0.068535 -0.297975 -0.087644 -0.393040 -0.010200 0.202278 0.234092 0.260167 0.310231 -0.503481 -0.344786 -0.317847 -0.379918 -0.370609 -0.253937 -0.169527 -0.238718 -0.245257 0.240492 0.240491 0.236376 0.236379 0.252714 0.244283 0.279945 0.223280 0.255145 0.234731 0.230871
chargesum: 0.00000
title: Mulliken charges with hydrogens summed into heavy atoms:
elementType: Cl N N C C C C C C C C C C C C C C C
charge: -0.068535 -0.297975 -0.087644 0.087944 -0.010200 0.202278 0.234092 0.260167 0.310231 -0.030727 -0.092072 -0.073564 -0.099973 -0.147329 0.001208 -0.169527 -0.003987 -0.014386
polarizability: 2.82244683e+02 2.41029690e+00 2.31311497e+02 3.28148891e-03 -1.63656541e-03 7.62421401e+01
1716.lowfreq: -10.2316 -8.9098 0.0006 0.0011 0.0012 4.9391 53.1085 88.2466 106.3398
frequency: 53.1026 88.2452 106.3387 128.4807 141.9196 161.6214 196.4674 234.6570 281.7703 282.8795 342.0202 342.6437 412.1852 422.9419 431.6989 449.6569 510.2724 526.2074 579.6136 583.1416 621.9705 655.8556 671.2361 680.3395 719.6858 759.4145 773.9251 781.2716 804.5076 806.4811 830.7479 878.1584 890.2467 912.7625 935.7779 945.0553 963.0801 973.4874 1001.9976 1003.3666 1022.3818 1044.3241 1074.7061 1090.5642 1102.4806 1126.2429 1161.4850 1175.3109 1178.8629 1216.1235 1236.5532 1279.0285 1280.1728 1293.2499 1310.3416 1349.1364 1356.4590 1381.8873 1390.7990 1420.5424 1452.2691 1467.1240 1481.7513 1485.5637 1500.9469 1558.3848 1569.7230 1606.0555 1611.3421 1621.3541 2980.4393 3006.5589 3028.9389 3059.3775 3132.5284 3147.2032 3153.5355 3159.0228 3170.9055 3173.5430 3175.9266
redmass: 6.4227 3.5034 4.2125 2.1460 9.2730 5.4230 4.1799 5.0266 4.1281 7.8546 7.8596 6.2894 6.3447 6.2623 3.3466 3.1909 3.3977 8.2077 3.9929 4.9957 6.9627 4.0662 6.4592 7.3283 3.2626 6.8159 2.7062 1.5239 7.1607 1.5319 1.2437 1.6554 1.4368 6.3388 1.3379 5.7382 4.2099 1.3824 6.6138 1.3427 5.2905 2.0977 1.6287 2.2511 2.2896 2.2500 1.5669 1.1368 1.0814 1.0757 1.7241 1.5598 1.6430 1.6680 1.4637 2.5988 2.8325 5.7880 8.8438 4.0719 3.2358 1.1903 2.5341 1.6232 1.6739 6.7535 7.0906 8.5460 7.1482 6.7712 1.0571 1.0600 1.1080 1.1064 1.0856 1.0895 1.0877 1.0950 1.0990 1.0952 1.0938
irintensity: 1.5171 0.0607 5.2227 0.1835 0.4188 1.3811 2.8519 3.8608 2.2713 0.1591 1.7888 0.2617 4.9582 1.7024 3.3207 1.3953 1.7731 25.1018 14.8870 7.6232 4.3809 20.0364 0.2107 9.9067 6.2235 5.1753 5.1207 46.3485 19.3169 67.8569 1.6516 12.5800 0.2949 6.8671 0.1106 7.2015 28.6658 2.2349 6.5057 0.5402 10.7136 9.9788 0.0000 19.9137 15.9670 9.2464 17.8694 1.4018 0.3456 0.4233 4.5499 11.9820 66.1028 24.0944 4.6125 42.5063 1.3919 4.4408 40.1698 46.9987 112.5874 8.7754 42.7730 70.7274 17.5557 53.0293 44.3385 71.3545 99.6272 20.2670 30.2525 92.8814 5.3528 40.9627 2.1236 11.5017 5.9700 10.3090 15.2315 17.1471 1.0653
temp: 298.150 k
press: 1.00000 atm
elementType: 17 7 7 6 6 6 6 6 6 6 6 6 6 6 6 6 6 6 1 1 1 1 1 1 1 1 1 1 1
symmnumber: 1
zpe: 579700.6 jmol-1
zpe.correction: 0.220796 hartree
zpe.thermalcorrener: 0.234405 hartree
zpe.thermalcorrenthalpy: 0.235349 hartree
zpe.thermalcorrgfe: 0.180128 hartree
zpe.sumelectzpe: -1146.550404 hartree
zpe.sumelectthermal: -1146.536796 hartree
zpe.sumelectthermalent: -1146.535851 hartree
zpe.sumelectthermalfe: -1146.591073 hartree
dipole: 0.5271 -1.5281 0.0003
dipole: 1.6165
quadrupole: -124.6090 -86.5368 -115.5358
quadrupole: 3.7347 0.0004 -0.0004
quadrupole: -15.7151 22.3571 -6.6419 3.7347 0.0004 -0.0004
hfenergy: -1146.7712005 hartree
pointgroup: C01 [X(C15H11Cl1N2)]
dipole: -0.0859556 0.6301378 0.0001092 debye
polarizability: 281.2249694|-7.5304051|232.3312112|-0.0028986|0.002246|76.2421401 unknown
InChI: InChI=1S/C15H11ClN2/c16-10-5-6-14-13(9-10)11-3-1-2-4-12(11)15-17-7-8-18(14)15/h1-6,9H,7-8H2
charge 0 multiplicity 1
29 atoms
Cl 4.841389 -1.522125 -0.000129
N  -0.282933 1.653394 0.000201
N  -2.581816 1.934068 -0.000002
C  -0.412991 3.131144 0.000089
C  -1.577238 1.077327 0.000077
C  0.90568 0.929072 0.000136
C  -1.671578 -0.386587 0.000073
C  0.843613 -0.509306 0.000069
C  -0.476428 -1.176939 0.00008
C  -1.977654 3.306301 0.000115
C  2.164827 1.590908 0.000141
C  2.065243 -1.22982 -0.000016
C  -2.950844 -0.998326 0.000076
C  -0.622227 -2.593731 0.000106
C  3.363453 0.85505 0.000066
C  3.293269 -0.552959 -0.000016
C  -3.067055 -2.398085 0.000089
C  -1.892856 -3.195632 0.000108
H  0.066447 3.565083 -0.897543
H  0.06649 3.565252 0.897609
H  -2.326578 3.858862 0.89106
H  -2.326608 3.859051 -0.890698
H  2.209559 2.683767 0.00021
H  2.063671 -2.322447 -0.000094
H  -3.829322 -0.345478 0.000067
H  0.26235 -3.237738 0.000135
H  4.331097 1.365247 0.000067
H  -4.054752 -2.870854 0.000096
H  -1.973809 -4.288202 0.00013
