program: Gaussian 09
title: 000285024
version: EM64L-G09RevD.01
frameworkgroup: C1[X(C15H12Cl2N2O)]
method: RPBEPBE
basis: SDD
operation: Freq
keyword: #p
keyword: freq=noraman
keyword: PBEPBE/SDD
title: #p freq=noraman PBEPBE/SDD
converged: YES YES NO NO
title: Mulliken charges:
elementType: Cl Cl O N N C C C C C C C C C C C C C C C H H H H H H H H H H H H
charge: -0.045462 -0.053128 -0.431288 -0.421664 -0.085807 0.343464 0.213536 0.287525 -0.002392 -0.022374 -0.368954 -0.304496 -0.356325 -0.389476 -0.297840 -0.249882 -0.163252 -0.264092 -0.116527 -0.304565 0.233768 0.223883 0.301228 0.221968 0.286450 0.213712 0.285914 0.261028 0.256355 0.225131 0.176788 0.346776
chargesum: 0.00000
title: Mulliken charges with hydrogens summed into heavy atoms:
elementType: Cl Cl O N N C C C C C C C C C C C C C C C
charge: -0.045462 -0.053128 -0.084512 -0.120437 -0.085807 0.343464 0.213536 0.287525 -0.002392 -0.022374 -0.135186 -0.080613 -0.134358 0.110686 -0.011926 0.011146 -0.163252 -0.007737 -0.116527 0.097354
polarizability: 3.50471103e+02 -1.05704839e+00 2.31496083e+02 -5.64317791e+00 -1.62071833e+01 8.94358001e+01
1716.lowfreq: -8.0804 -4.0548 -0.0016 0.0011 0.0019 2.4200 21.0132 36.4292 43.2161
frequency: 20.9911 36.4137 43.2024 82.2945 92.9553 108.6498 120.0527 129.9672 179.1698 221.9030 232.2800 236.8028 266.1735 288.5386 325.4155 349.0337 369.5254 374.7771 382.2623 410.7226 438.8426 461.9544 476.4140 512.9613 536.2282 551.4113 560.3315 590.1999 602.4636 650.4076 671.1903 710.2379 724.2550 728.3784 769.9757 810.4258 821.1492 833.9912 849.6387 859.3431 883.2071 890.6129 919.8098 942.9520 964.4483 986.3193 1004.9411 1051.9435 1067.5642 1086.3577 1095.7992 1116.6140 1140.9846 1150.5319 1185.0158 1211.7772 1237.6991 1263.6221 1270.2878 1290.7841 1310.2035 1316.9308 1346.0420 1367.2831 1379.6110 1389.8136 1402.9654 1423.9400 1448.8483 1453.9520 1468.1791 1473.9669 1509.7793 1529.3908 1553.4467 1578.7722 1604.7288 1609.6545 2923.8357 2967.6258 3074.2643 3095.7456 3144.4527 3152.1209 3157.2762 3176.0621 3178.3692 3183.0366 3531.5584 3562.7208
redmass: 6.0207 10.4497 6.2135 5.0961 5.5656 3.1306 11.7869 5.2949 3.8797 4.9801 7.8023 9.0996 2.8580 5.6431 3.1014 4.3332 2.1599 7.2546 3.0416 2.3254 3.0539 4.2572 3.4592 1.9876 3.3997 2.3994 7.3323 4.6873 6.0927 7.1466 5.6026 6.1347 4.0242 6.9129 2.0645 1.4312 6.0820 1.9804 2.9071 1.7816 1.8096 1.5188 4.5991 1.3679 1.3443 6.7725 2.9879 3.6766 1.9400 2.1047 2.1237 2.8317 1.6337 1.3939 1.4706 1.2788 1.4856 1.4661 2.7953 2.5056 1.3178 1.5693 1.6502 2.8867 1.2883 5.2100 4.7398 5.5351 3.0172 2.6495 1.1387 1.1333 2.3905 3.4006 6.9686 9.5543 6.7011 6.7975 1.0715 1.0698 1.0917 1.0927 1.0884 1.0914 1.0871 1.0963 1.0968 1.0934 1.0655 1.0758
irintensity: 2.0429 0.9548 0.8343 3.4081 1.7564 4.1682 1.2757 1.4749 6.1469 0.7650 0.8943 0.3044 2.4495 1.9196 16.2530 0.2750 37.3854 18.6239 13.7740 66.0519 36.6133 20.9337 5.0337 71.5662 28.0751 62.6353 4.5997 3.4201 0.9038 2.7078 0.0931 7.8558 11.6516 91.9460 10.6987 65.1446 7.6429 14.4728 18.7112 17.4000 1.8441 22.6652 58.3582 0.1001 0.0416 23.3684 52.6500 28.5982 25.9662 45.3018 18.3761 25.7809 5.9365 1.7968 26.9552 84.6066 20.7628 7.1017 21.6462 36.5099 15.3692 27.4490 3.7309 17.3881 28.5929 10.3829 19.5998 28.8604 91.4782 83.1849 8.9929 46.1750 70.3686 338.5829 106.0348 159.7419 70.2516 25.4257 84.1553 78.8875 36.6437 8.5182 5.3124 6.7431 3.6925 0.8608 9.7940 0.4695 5.0009 33.5480
temp: 298.150 k
press: 1.00000 atm
elementType: 17 17 8 7 7 6 6 6 6 6 6 6 6 6 6 6 6 6 6 6 1 1 1 1 1 1 1 1 1 1 1 1
symmnumber: 1
zpe: 619108.0 jmol-1
zpe.correction: 0.235806 hartree
zpe.thermalcorrener: 0.253536 hartree
zpe.thermalcorrenthalpy: 0.254480 hartree
zpe.thermalcorrgfe: 0.188110 hartree
zpe.sumelectzpe: -1682.256735 hartree
zpe.sumelectthermal: -1682.239005 hartree
zpe.sumelectthermalent: -1682.238061 hartree
zpe.sumelectthermalfe: -1682.304431 hartree
dipole: 2.6297 -2.1467 -1.9285
dipole: 3.9042
quadrupole: -142.1482 -122.6848 -135.7825
quadrupole: 7.4329 -4.6709 -13.6721
quadrupole: -8.6097 10.8537 -2.2440 7.4329 -4.6709 -13.6721
hfenergy: -1682.4925406 hartree
pointgroup: C01 [X(C15H12Cl2N2O1)]
dipole: -0.6450035 1.0951503 -0.862559 debye
polarizability: 334.2811449|-37.2364114|245.8263217|29.2604964|2.7994417|91.2955193 unknown
InChI: InChI=1S/C15H12Cl2N2O/c16-9-1-3-11-12-4-2-10(17)8-14(12)19-15(13(11)7-9)18-5-6-20/h1-4,7-8,18,20H,5-6H2
charge 0 multiplicity 1
32 atoms
Cl -3.954664 3.547312 -0.379392
Cl 5.392059 -1.702644 0.555213
O  -3.050629 -3.510632 1.477622
N  -2.037939 -1.583366 -0.556501
N  0.270104 -1.450383 -0.208364
C  0.173999 1.423115 -0.041013
C  -1.026261 0.653644 -0.241633
C  1.450802 0.723211 0.094904
C  -0.898631 -0.813312 -0.337123
C  1.431128 -0.715848 0.019454
C  0.060683 2.844685 0.030896
C  -2.284363 1.318039 -0.336301
C  2.699623 1.376136 0.305231
C  -2.000957 -3.047659 -0.734359
C  2.645221 -1.452494 0.163605
C  -1.175299 3.494098 -0.078892
C  -2.340876 2.710927 -0.258197
C  3.892763 0.651893 0.444091
C  3.839719 -0.763836 0.371264
C  -3.159407 -3.710265 0.032025
H  0.95507 3.456158 0.178632
H  -3.221685 0.766066 -0.452212
H  -2.887254 -1.106597 -0.860221
H  2.751727 2.467666 0.365525
H  -1.02846 -3.389973 -0.346924
H  -2.054994 -3.317929 -1.81001
H  2.601297 -2.542305 0.104343
H  -1.245944 4.583836 -0.021749
H  4.846077 1.161873 0.606454
H  -3.130678 -4.801802 -0.122564
H  -4.138138 -3.333747 -0.34523
H  -2.803795 -2.561963 1.634624
