program: Gaussian 09
title: 000285037
version: EM64L-G09RevD.01
frameworkgroup: C1[X(C14H23NO3)]
method: RPBEPBE
basis: SDD
operation: Freq
keyword: #p
keyword: freq=noraman
keyword: PBEPBE/SDD
title: #p freq=noraman PBEPBE/SDD
converged: NO YES NO NO
title: Mulliken charges:
elementType: O O O N C C C C C C C C C C C C C C H H H H H H H H H H H H H H H H H H H H H H H
charge: -0.470527 -0.285760 -0.209261 -0.006242 0.277394 -0.035400 -0.488654 -0.482407 -0.199005 -0.492705 -0.402629 -0.431930 -0.395211 -0.410314 0.110709 -0.785142 0.276227 -0.752617 0.187036 0.208435 0.194609 0.200138 0.206369 0.286163 0.240802 0.225407 0.195622 0.224749 0.193925 0.204480 0.199343 0.194129 0.190770 0.202340 0.336157 0.249464 0.236474 0.261562 0.252971 0.244544 0.247987
chargesum: 0.00000
title: Mulliken charges with hydrogens summed into heavy atoms:
elementType: O O O N C C C C C C C C C C C C C C
charge: -0.134370 -0.285760 -0.209261 -0.006242 0.277394 0.151636 -0.085611 -0.075900 0.087158 -0.026495 0.017742 -0.033524 -0.001740 -0.017205 0.110709 -0.037642 0.276227 -0.007115
polarizability: 1.85047177e+02 -6.84244371e+00 1.65638348e+02 6.60707687e+00 -6.77656696e+00 1.48091576e+02
1716.lowfreq: -0.0010 -0.0008 0.0006 7.0248 11.0003 23.8018 39.9697 44.5450 51.0068
frequency: 32.6339 43.3562 49.4628 65.5304 78.0986 109.3457 125.3340 141.9199 155.6848 174.5603 212.7304 224.2603 235.3656 263.5839 294.8491 300.9825 321.0911 337.0554 342.0932 371.4735 384.9904 408.0150 424.2865 453.1186 458.4915 520.7046 527.2173 530.2842 561.3021 563.1555 604.4219 605.0435 701.3852 788.5353 799.9439 824.6861 838.7193 851.0388 859.1842 868.2315 880.1712 912.9422 927.1389 944.0092 968.4807 988.0803 989.6510 1000.1169 1014.5336 1035.3113 1039.1635 1049.6768 1060.8249 1092.2284 1101.8996 1110.4184 1115.4584 1128.7402 1143.3790 1150.8845 1159.4966 1181.3687 1191.6450 1223.8114 1235.4663 1252.0134 1259.1973 1296.6334 1308.8557 1313.4443 1317.3746 1319.3517 1335.1998 1339.7806 1341.6379 1344.8405 1353.7600 1357.7220 1380.4571 1387.1444 1388.1669 1446.1454 1453.3172 1456.9375 1462.9080 1463.9168 1467.0646 1468.3073 1471.1736 1474.3113 1481.5680 1485.2457 1576.9586 1682.7490 2929.5592 2963.4247 2966.0448 2968.0883 2969.7363 2975.5569 2986.1745 2993.2803 3004.8852 3005.9187 3014.3020 3025.3274 3026.0393 3030.9863 3034.1368 3038.5729 3048.1601 3070.7962 3081.2058 3100.4462 3120.6420 3136.2739 3571.6550
redmass: 5.5035 1.5461 1.8133 4.8651 2.8401 3.8829 3.7698 2.2121 1.6276 2.9447 2.3708 3.4811 1.0848 3.6688 2.3888 3.2330 3.9410 3.8662 2.2959 2.3219 3.6327 3.1297 3.1541 3.0715 4.0037 3.1219 2.1529 1.8114 3.3840 3.3437 2.5437 5.2537 3.4583 1.9851 7.1463 1.7783 2.3298 2.0732 1.7500 4.7897 1.9338 2.3539 1.6075 3.3492 2.0016 1.9912 2.1650 2.2964 2.0209 1.9619 1.6327 1.7141 1.5067 1.5785 2.2691 2.4729 2.1547 1.5048 1.7855 1.8066 3.0400 1.6858 1.6748 1.4797 1.3714 1.5709 1.2558 1.5508 1.4475 1.3497 1.2873 1.4152 1.3868 1.4109 1.3812 1.4225 1.4460 1.4363 1.2181 1.2691 1.4451 1.0823 1.0533 1.0522 1.0811 1.0863 1.0868 1.0796 1.0856 1.0845 1.0824 1.0868 7.4987 11.0728 1.0802 1.0632 1.0626 1.0606 1.0592 1.0624 1.0635 1.0404 1.0657 1.0374 1.0915 1.0958 1.0967 1.0969 1.0972 1.0998 1.1015 1.1017 1.0917 1.0948 1.1004 1.1024 1.0663
irintensity: 1.8998 1.4820 0.2329 1.9641 2.6165 1.4106 2.1718 2.6400 2.5552 0.6234 1.7836 0.7285 118.7740 5.2622 0.3381 0.5351 5.2361 1.7021 2.8154 1.5053 1.1769 2.1584 8.0314 1.9657 4.3717 1.8959 2.6578 3.5574 2.7249 6.8186 1.6345 2.4930 2.2845 18.7337 233.9590 5.8535 20.2956 7.5698 1.6320 37.6867 4.6650 7.3760 17.2796 48.0644 77.5403 8.2563 19.3972 8.1342 10.7822 14.1242 14.2422 5.3012 1.2792 12.6861 17.5487 6.8727 2.1361 0.5795 12.7457 21.7742 284.1584 12.9810 46.2874 4.4647 3.7511 2.2370 1.6679 4.0189 4.7470 0.8278 2.1401 4.1260 1.8028 0.2563 1.9280 6.3834 0.3527 3.3559 43.1867 45.4661 7.8992 9.2657 17.0775 14.8460 5.0489 12.3381 5.7743 16.3621 7.5023 19.1920 16.4577 6.9807 18.1975 208.5836 17.3429 43.0685 31.7087 15.6090 41.9701 47.8112 34.2535 9.7922 10.8316 3.2130 12.2873 75.0396 24.5608 81.7857 20.9656 52.6060 85.1998 31.2221 13.4325 8.9253 8.6602 9.8108 3.6882
temp: 298.150 k
press: 1.00000 atm
elementType: 8 8 8 7 6 6 6 6 6 6 6 6 6 6 6 6 6 6 1 1 1 1 1 1 1 1 1 1 1 1 1 1 1 1 1 1 1 1 1 1 1
symmnumber: 1
zpe: 920194.2 jmol-1
zpe.correction: 0.350483 hartree
zpe.thermalcorrener: 0.369431 hartree
zpe.thermalcorrenthalpy: 0.370376 hartree
zpe.thermalcorrgfe: 0.303446 hartree
zpe.sumelectzpe: -826.252459 hartree
zpe.sumelectthermal: -826.233511 hartree
zpe.sumelectthermalent: -826.232567 hartree
zpe.sumelectthermalfe: -826.299497 hartree
dipole: -0.9138 -2.8143 2.7558
dipole: 4.0435
quadrupole: -102.7028 -105.7807 -108.8904
quadrupole: 3.5185 2.4083 1.7629
quadrupole: 3.0885 0.0106 -3.0991 3.5185 2.4083 1.7629
hfenergy: -826.6029429 hartree
pointgroup: C01 [X(C14H23N1O3)]
dipole: 0.2608615 0.9380246 1.2581174 debye
polarizability: 184.8798347|-9.2691573|165.2183953|-1.0489055|7.9155095|148.6788712 unknown
InChI: InChI=1S/C14H23NO3/c1-10(15-18-11(2)16)14-8-4-3-6-12(14)13(17)7-5-9-14/h12-13,17H,3-9H2,1-2H3
charge 0 multiplicity 1
41 atoms
O  -1.675175 -2.302459 -1.971542
O  2.573532 0.316716 0.633592
O  3.172099 -1.705114 -0.435284
N  1.153193 0.004522 0.224034
C  -1.19267 0.512011 0.613478
C  -1.510378 -0.245418 -0.728896
C  -1.803915 -0.310773 1.798941
C  -1.884505 1.912455 0.515016
C  -1.080321 -1.729177 -0.735395
C  -1.03123 0.531929 -1.979208
C  -1.296716 -1.770173 1.825263
C  -1.622967 -2.488977 0.495267
C  -1.414448 2.72455 -0.715401
C  -1.658403 1.944909 -2.029879
C  0.308768 0.722773 0.928755
C  0.705391 1.689921 2.027145
C  3.490484 -0.645936 0.129577
C  4.898984 -0.148059 0.395416
H  -2.624154 -0.269604 -0.774595
H  -2.905708 -0.308888 1.667398
H  -1.599976 0.18938 2.766075
H  -1.728411 2.491881 1.44487
H  -2.976841 1.735394 0.436991
H  0.022507 -1.801412 -0.781189
H  -1.317112 -0.048724 -2.873696
H  0.072284 0.602772 -1.97589
H  -1.766235 -2.312259 2.668595
H  -0.203787 -1.787774 2.002617
H  -1.215172 -3.519647 0.509649
H  -2.7227 -2.573726 0.377983
H  -0.332769 2.953972 -0.621953
H  -1.94332 3.697423 -0.740494
H  -2.752174 1.852207 -2.196031
H  -1.252167 2.512659 -2.889401
H  -1.276481 -3.195725 -2.123506
H  0.846791 2.704282 1.607458
H  -0.07506 1.755203 2.802062
H  1.658433 1.388245 2.488196
H  5.268548 0.38439 -0.500054
H  4.9280 0.548994 1.246911
H  5.56168 -1.008044 0.578924
