program: Gaussian 09
title: 000285067
version: EM64L-G09RevD.01
frameworkgroup: C1[X(C20H22N4O8S)]
method: RPBEPBE
basis: SDD
operation: Freq
keyword: #p
keyword: freq=noraman
keyword: PBEPBE/SDD
title: #p freq=noraman PBEPBE/SDD
converged: YES YES NO NO
title: Mulliken charges:
elementType: S O O O O O O O O N N N N C C C C C C C C C C C C C C C C C C C C H H H H H H H H H H H H H H H H H H H H H H
charge: 0.874198 -0.240726 -0.240715 -0.525040 -0.525032 -0.203298 -0.203252 -0.218093 -0.218071 -0.160990 -0.160984 0.002453 0.002387 -0.381702 -0.386756 -0.381665 -0.386838 0.386728 0.386833 -0.306984 -0.313653 -0.306946 -0.313643 -0.088931 -0.088934 0.233759 0.233777 -0.322868 -0.322959 -0.363593 -0.363518 -0.259570 -0.259613 0.233298 0.230956 0.241687 0.236719 0.233323 0.230902 0.241721 0.236743 0.206246 0.228508 0.222215 0.245426 0.206235 0.228512 0.222222 0.245444 0.253815 0.253754 0.323293 0.323268 0.289979 0.289972
chargesum: 0.00000
title: Mulliken charges with hydrogens summed into heavy atoms:
elementType: S O O O O O O O O N N N N C C C C C C C C C C C C C C C C C C C C
charge: 0.874198 -0.240726 -0.240715 -0.525040 -0.525032 -0.203298 -0.203252 -0.218093 -0.218071 -0.160990 -0.160984 0.002453 0.002387 0.082552 0.091650 0.082560 0.091626 0.386728 0.386833 0.127770 0.153989 0.127801 0.154023 -0.088931 -0.088934 0.233759 0.233777 -0.069053 -0.069206 -0.040300 -0.040250 0.030409 0.030360
polarizability: 4.39057368e+02 1.09368912e-02 2.61315472e+02 1.42057988e+01 5.72845307e-02 3.18663905e+02
1716.lowfreq: -3.5625 -0.0017 -0.0010 0.0010 3.9037 8.7332 12.1267 15.5426 18.2068
frequency: 12.1221 15.5361 18.1740 36.9861 46.3688 53.2514 62.5771 71.1992 71.7006 93.1547 102.0659 107.6933 108.8114 143.5187 150.1987 174.1620 177.9829 180.9282 189.1084 211.0239 222.2745 251.9806 254.7613 268.6781 273.0911 291.1341 297.3478 323.8118 324.5938 350.0683 354.9017 373.8810 385.2968 405.8067 413.2872 414.4285 421.7418 423.1844 446.0399 447.0282 453.1707 453.3195 471.8498 525.5902 536.6899 551.7956 552.3999 583.3629 583.4515 622.2533 628.4215 642.1231 642.9539 681.9904 683.7052 715.0979 717.7957 734.0619 734.7887 776.9779 799.6468 799.8998 810.3306 814.6335 821.6597 822.1270 840.0239 840.2691 909.8495 910.1860 912.6496 913.6727 927.4158 936.1749 939.6843 974.5973 977.3558 1012.1042 1012.2335 1026.1956 1027.1091 1049.8292 1049.9259 1061.4266 1062.9743 1071.4923 1073.2296 1076.2385 1080.2173 1102.7635 1102.7920 1137.9068 1139.3017 1170.8711 1171.0828 1181.9966 1182.3815 1199.0359 1199.0525 1232.9230 1234.1344 1248.8201 1250.1071 1264.3655 1265.0109 1279.6728 1280.1935 1327.4483 1327.6870 1337.4167 1338.3867 1340.0191 1340.0334 1354.5487 1354.5948 1367.7424 1367.8825 1371.0667 1372.7660 1383.1269 1383.4101 1422.2641 1422.3179 1447.9481 1447.9643 1450.8459 1451.0983 1459.7689 1459.8607 1463.9252 1464.3848 1497.0196 1499.3416 1560.6432 1565.8828 1601.0240 1601.9185 2951.6869 2951.7387 2955.5471 2955.7788 2966.6915 2966.7499 3010.8617 3010.8880 3075.2627 3075.3090 3085.9997 3086.0206 3104.7824 3104.8263 3135.0921 3135.1410 3151.8722 3151.9236 3165.6954 3165.7466 3178.7777 3178.9373
redmass: 6.9414 6.8479 7.7704 5.4886 6.5263 8.4456 6.8504 5.8139 4.9697 8.7341 4.6882 6.4400 4.9157 5.4000 7.0846 4.4809 6.5573 9.4078 4.5586 9.7874 6.1584 3.2470 6.1111 2.8117 5.0086 5.0579 4.5698 4.8151 3.8542 5.4707 4.1347 4.9580 5.2282 5.3626 7.9240 4.0652 2.5485 3.1013 3.4618 3.4195 3.0803 3.1075 8.4161 3.3803 3.2079 4.0070 3.7547 4.2357 4.2316 3.1928 3.2786 6.5973 6.0717 8.1057 7.3917 5.4890 5.9850 4.7087 4.5796 14.5900 4.2405 4.1411 6.5082 6.5044 1.5518 1.5346 1.6750 1.7028 2.8155 2.6633 3.2846 3.3135 9.6930 1.5430 1.4713 1.3406 1.3384 2.3979 2.4008 2.7833 2.7532 2.0982 2.0937 2.8342 3.4952 3.0876 3.4176 3.9736 2.8860 2.1370 2.1365 2.6173 2.7220 1.7571 1.7128 4.4519 4.3761 1.2253 1.2250 1.4728 1.4642 1.2292 1.2196 1.3974 1.4162 1.1979 1.1980 1.4850 1.4206 2.9841 3.3070 1.3743 1.3763 1.4179 1.3910 1.5649 1.4761 2.6350 3.0195 2.3376 2.4169 3.6658 3.7652 1.0829 1.0826 1.1017 1.0991 1.1046 1.1021 1.1774 1.1693 3.1069 3.1884 8.8737 8.8175 6.5767 6.6255 1.0679 1.0680 1.0716 1.0716 1.0649 1.0649 1.0617 1.0617 1.0951 1.0951 1.0986 1.0986 1.1041 1.1041 1.0900 1.0900 1.0895 1.0896 1.0915 1.0915 1.0942 1.0943
irintensity: 0.0012 2.3237 1.5008 0.8585 0.2454 1.7284 0.4806 1.4336 0.1421 5.5450 4.9683 0.1905 0.8269 1.0018 1.3703 2.4348 4.1048 7.4817 2.0272 1.0990 1.8142 21.8637 3.1988 1.9018 7.2623 1.5358 29.7020 0.1427 5.1494 2.0804 1.3632 0.0256 39.5895 0.6755 17.6030 5.0584 0.1919 20.1733 22.8227 1.1686 0.6936 1.5660 108.4408 0.6858 99.3509 94.9051 58.2682 13.5480 43.6354 0.6684 4.1191 21.1210 0.3050 0.0476 0.7446 2.3669 3.3822 3.0917 1.4953 84.3153 17.3085 7.8879 23.3314 27.0061 14.4138 18.3733 1.0533 10.8839 23.1409 31.0873 72.7485 29.0004 50.4832 2.8544 7.7187 0.6949 6.5371 6.5212 9.5394 62.5326 13.4659 34.2444 10.1245 37.0723 13.1022 81.2773 40.2962 95.0090 13.3690 2.6566 3.8529 7.8153 7.5371 3.3992 37.5307 5.3025 578.6905 33.0257 62.1827 79.5977 12.2407 82.5544 0.3679 23.5339 80.8441 55.8628 19.7625 5.6637 2.2770 0.4958 117.6405 11.0983 8.8485 18.3085 27.4581 0.7896 0.0337 0.0053 19.7907 0.2194 16.6335 1.0152 4.2514 13.6751 2.3769 64.0778 13.0695 52.3373 0.5006 159.5501 11.9672 178.0034 114.1623 18.5470 105.9136 233.3484 134.5345 61.8430 21.5190 19.4452 81.9563 53.0147 68.3792 31.7067 22.1511 13.0924 21.1100 54.0768 12.7266 4.8901 48.6269 7.0981 6.5573 1.5579 3.6353 22.3385 3.5975 16.3240 3.7379
temp: 298.150 k
press: 1.00000 atm
elementType: 16 8 8 8 8 8 8 8 8 7 7 7 7 6 6 6 6 6 6 6 6 6 6 6 6 6 6 6 6 6 6 6 6 1 1 1 1 1 1 1 1 1 1 1 1 1 1 1 1 1 1 1 1 1 1
symmnumber: 1
zpe: 1081453.6 jmol-1
zpe.correction: 0.411904 hartree
zpe.thermalcorrener: 0.442030 hartree
zpe.thermalcorrenthalpy: 0.442975 hartree
zpe.thermalcorrgfe: 0.347819 hartree
zpe.sumelectzpe: -1991.352153 hartree
zpe.sumelectthermal: -1991.322027 hartree
zpe.sumelectthermalent: -1991.321082 hartree
zpe.sumelectthermalfe: -1991.416238 hartree
dipole: 0.0026 -6.3376 0.0042
dipole: 6.3376
quadrupole: -201.9575 -226.8813 -209.8707
quadrupole: 0.0248 44.2852 -0.0026
quadrupole: 10.9456 -13.9781 3.0324 0.0248 44.2852 -0.0026
hfenergy: -1991.7640571 hartree
pointgroup: C01 [X(C20H22N4O8S1)]
dipole: 0.0029907 2.4933539 0.0140763 debye
polarizability: 439.6622463|-0.2211716|261.3177046|-11.3398837|-0.3219498|318.0567943 unknown
InChI: InChI=1S/C20H22N4O8S/c25-23(26)19-13-15(1-3-17(19)21-5-9-31-10-6-21)33(29,30)16-2-4-18(20(14-16)24(27)28)22-7-11-32-12-8-22/h1-4,13-14H,5-12H2
charge 0 multiplicity 1
55 atoms
S  -0.002057 -2.827039 -0.015974
O  7.17913 2.568053 -0.615705
O  -7.165694 2.584618 0.641439
O  -0.093637 -3.584971 -1.464472
O  0.087216 -3.601573 1.42385
O  3.284153 -0.399421 3.33411
O  -3.279673 -0.350435 -3.339026
O  5.226834 0.044965 2.231988
O  -5.221705 0.085351 -2.232261
N  4.800669 0.925913 -0.480198
N  -4.792613 0.936059 0.489282
N  3.959171 -0.230435 2.24114
N  -3.954778 -0.193325 -2.244338
C  5.57867 1.018658 -1.739345
C  4.963425 2.133765 0.371666
C  -5.570264 1.018534 1.749341
C  -4.951427 2.153044 -0.350191
C  3.774294 0.005071 -0.321928
C  -3.769404 0.01346 0.321204
C  7.054647 1.341165 -1.408539
C  6.449688 2.406001 0.657077
C  -7.045196 1.349479 1.422042
C  -6.436782 2.43285 -0.63288
C  1.496784 -1.687208 -0.126646
C  -1.497353 -1.683885 0.107377
C  3.259698 -0.438333 0.958159
C  -3.256067 -0.417444 -0.963659
C  3.131687 -0.546183 -1.486972
C  -3.128916 -0.552905 1.48013
C  2.10609 -1.256655 1.046547
C  -2.105047 -1.238326 -1.061044
C  2.013366 -1.380312 -1.402901
C  -2.013281 -1.389688 1.386885
H  5.1631 1.810382 -2.39889
H  5.547863 0.05463 -2.273838
H  4.398597 2.04022 1.307538
H  4.550147 2.996303 -0.195274
H  -5.151877 1.801921 2.4170
H  -5.542753 0.048924 2.273834
H  -4.386777 2.067359 -1.286917
H  -4.535473 3.008469 0.225504
H  7.502714 0.486024 -0.859087
H  7.620439 1.523371 -2.336945
H  6.577293 3.359314 1.193788
H  6.881465 1.575545 1.246843
H  -7.496337 0.501369 0.864253
H  -7.61016 1.52439 2.352355
H  -6.561353 3.391839 -1.160114
H  -6.871214 1.609668 -1.230829
H  3.487374 -0.252023 -2.477336
H  -3.483963 -0.268863 2.473674
H  1.75733 -1.585019 2.030655
H  -1.75718 -1.556792 -2.048713
H  1.533876 -1.786923 -2.299771
H  -1.535343 -1.807954 2.279216
