program: Gaussian 09
title: 000285016
version: EM64L-G09RevD.01
frameworkgroup: C1[X(C15H15NO3S)]
method: RPBEPBE
basis: SDD
operation: Freq
keyword: #p
keyword: freq=noraman
keyword: PBEPBE/SDD
title: #p freq=noraman PBEPBE/SDD
converged: YES YES NO NO
title: Mulliken charges:
elementType: S O O O N C C C C C C C C C C C C C C C H H H H H H H H H H H H H H H
charge: 0.207660 -0.466800 -0.208403 -0.207609 0.027729 -0.220560 -0.623486 0.480638 0.489335 -0.447790 -0.375493 -0.371091 -0.399583 -0.166371 -0.222842 -0.355160 -0.358283 -0.217275 0.367919 -0.864616 0.218668 0.238879 0.246312 0.226220 0.277382 0.247784 0.273267 0.237477 0.240550 0.358513 0.286716 0.288424 0.262988 0.263693 0.265210
chargesum: 0.00000
title: Mulliken charges with hydrogens summed into heavy atoms:
elementType: S O O O N C C C C C C C C C C C C C C C
charge: 0.207660 -0.108288 -0.208403 -0.207609 0.027729 -0.001892 -0.138294 0.480638 0.489335 -0.221570 -0.098112 -0.123307 -0.126316 0.071106 0.017707 -0.068445 -0.069858 -0.217275 0.367919 -0.072725
polarizability: 3.81904489e+02 -8.24292899e+00 1.89118114e+02 1.87905422e+01 1.27070779e+01 9.68159079e+01
1716.lowfreq: -7.6412 -5.7135 -0.0013 -0.0008 0.0009 3.1066 16.2651 19.9864 26.4294
frequency: 15.8285 19.9645 26.4048 40.6511 45.3328 65.1014 69.2163 128.4373 139.5674 156.8788 203.9919 215.2446 222.9646 281.4035 293.9533 330.9367 333.0505 348.8924 355.9796 394.4752 404.0125 410.8513 426.8935 488.1276 506.6453 509.3022 538.2991 611.5675 627.3166 628.7481 653.4268 672.2128 680.5248 720.0699 730.8715 763.1691 798.8390 810.3518 828.5243 847.3409 853.1954 864.7031 876.6696 940.5757 966.2532 976.8417 984.0029 987.9469 991.5547 993.9101 1003.3357 1005.5961 1009.7201 1073.5493 1092.5205 1107.1615 1122.2101 1155.1745 1175.0517 1180.4156 1195.7508 1213.6007 1220.6361 1225.2850 1263.8847 1296.5862 1302.0824 1307.2227 1348.6033 1361.4173 1365.6651 1389.1114 1401.1697 1403.1443 1417.9168 1454.4151 1458.3316 1462.9679 1479.1620 1486.0562 1575.6422 1592.9983 1604.5707 1610.7592 2940.7612 3006.4236 3008.4957 3073.1579 3110.7392 3122.4138 3133.8036 3134.6837 3136.3300 3144.4212 3157.5351 3172.6622 3180.9635 3183.3953 3546.3477
redmass: 4.0454 6.3819 6.5418 4.8634 4.4871 8.1737 6.1891 5.6592 6.9159 4.6500 4.8835 2.8781 1.3352 4.0388 6.3680 1.3729 3.0619 6.7924 2.7664 5.7148 2.8864 2.8388 3.9093 4.6967 6.2455 3.6291 2.7146 6.0902 6.7162 7.0949 5.2443 5.2027 5.9387 4.4117 4.2151 6.6548 3.0595 2.4309 1.7613 1.3955 1.2809 2.5648 2.0975 1.3949 1.1823 1.6309 1.4129 1.3443 1.9725 1.4907 3.2086 3.1571 2.8718 3.5217 3.3411 1.3510 1.3507 1.3553 1.2719 1.3140 1.1292 2.5756 4.7999 1.4972 1.4763 1.2493 1.2808 1.2217 1.1656 3.1846 7.3178 2.0544 6.6055 3.1570 3.3298 1.0524 1.1263 1.0709 2.4182 2.3444 6.8964 7.6297 6.2788 6.2105 1.0842 1.0292 1.0597 1.1033 1.0891 1.1062 1.1019 1.0896 1.0906 1.0905 1.0931 1.0947 1.0943 1.0954 1.0658
irintensity: 0.5741 1.0572 0.3643 0.6770 6.6263 0.1528 0.7861 0.2223 1.4137 0.4198 2.7722 1.9652 0.7058 6.4754 2.3992 144.7493 34.6535 4.6104 3.1475 2.1531 1.1382 4.2850 6.9636 9.4750 1.3804 2.1771 50.5027 6.2935 0.2314 0.6166 8.0833 18.2337 4.2039 5.8689 2.2147 23.2874 4.2904 16.5123 29.3354 44.6613 1.3948 26.8964 18.6421 6.0521 10.3393 17.5150 15.8189 14.8381 20.0361 5.2274 26.7143 6.6354 25.1364 56.2635 21.6388 30.9023 2.8489 36.7398 39.9852 65.9887 29.0077 7.6613 386.9984 14.6403 11.8236 16.2312 1.8663 19.0778 0.5660 39.8676 94.0195 29.6283 2.0193 4.8300 47.7025 15.7018 7.2093 45.5755 10.1477 58.1788 0.7579 3.1323 116.7668 27.6789 31.7996 27.4141 23.2381 9.0452 19.1872 18.9239 7.8675 6.8248 9.1540 4.5333 12.0477 1.7051 0.1320 3.9519 1.9650
temp: 298.150 k
press: 1.00000 atm
elementType: 16 8 8 8 7 6 6 6 6 6 6 6 6 6 6 6 6 6 6 6 1 1 1 1 1 1 1 1 1 1 1 1 1 1 1
symmnumber: 1
zpe: 700981.0 jmol-1
zpe.correction: 0.266990 hartree
zpe.thermalcorrener: 0.286175 hartree
zpe.thermalcorrenthalpy: 0.287119 hartree
zpe.thermalcorrgfe: 0.215448 hartree
zpe.sumelectzpe: -1257.546658 hartree
zpe.sumelectthermal: -1257.527472 hartree
zpe.sumelectthermalent: -1257.526528 hartree
zpe.sumelectthermalfe: -1257.598200 hartree
dipole: -4.6151 2.6615 -0.9314
dipole: 5.4084
quadrupole: -167.4983 -114.9281 -128.8116
quadrupole: -14.5639 -0.5589 3.0659
quadrupole: -30.4190 22.1512 8.2677 -14.5639 -0.5589 3.0659
hfenergy: -1257.8136474 hartree
pointgroup: C01 [X(C15H15N1O3S1)]
dipole: 1.7712823 -1.1338428 -0.3234335 debye
polarizability: 379.2196598|-16.8805039|186.1689732|-29.5103737|-20.9878375|102.4498778 unknown
InChI: InChI=1S/C15H15NO3S/c1-20-14-8-4-12(5-9-14)15(17)10-11-2-6-13(7-3-11)16(18)19/h2-9,15,17H,10H2,1H3
charge 0 multiplicity 1
35 atoms
S  6.727896 0.117877 -0.662954
O  0.306381 1.672721 0.923668
O  -6.443628 -0.998079 0.746943
O  -6.494685 1.156772 -0.001275
N  -5.873324 0.055871 0.264288
C  0.652183 0.295579 0.554064
C  -0.144524 -0.153279 -0.726716
C  2.150923 0.242593 0.303224
C  -1.6436 -0.115899 -0.510879
C  2.845528 -0.984582 0.408051
C  2.870642 1.400281 -0.08336
C  -2.330438 -1.239771 0.025951
C  -2.384334 1.068274 -0.783461
C  4.226966 -1.06888 0.124605
C  4.248843 1.327824 -0.364316
C  -3.713352 -1.194674 0.283523
C  -3.769656 1.134523 -0.534296
C  4.937261 0.090178 -0.268417
C  -4.414879 -0.001508 0.000372
C  7.23251 -1.669334 -0.400311
H  0.387833 -0.400574 1.380775
H  0.187818 -1.173593 -0.991457
H  0.153277 0.520681 -1.550221
H  2.313696 -1.89152 0.724508
H  2.345436 2.358202 -0.134844
H  -1.774413 -2.161254 0.233571
H  -1.870328 1.932332 -1.218512
H  4.732231 -2.034719 0.220742
H  4.793256 2.2340 -0.653733
H  -0.663786 1.72144 1.122719
H  -4.255836 -2.052134 0.690357
H  -4.35353 2.034337 -0.745545
H  8.308657 -1.703704 -0.629728
H  6.689651 -2.335167 -1.089433
H  7.071119 -1.971714 0.646295
