program: Gaussian 09
title: 000284999
version: EM64L-G09RevD.01
frameworkgroup: C1[X(C11H15N3O2)]
method: RPBEPBE
basis: SDD
operation: Freq
keyword: #p
keyword: freq=noraman
keyword: PBEPBE/SDD
title: #p freq=noraman PBEPBE/SDD
converged: YES YES NO NO
title: Mulliken charges:
elementType: O O N N N C C C C C C C C C C C H H H H H H H H H H H H H H H
charge: -0.233182 -0.230033 -0.001236 -0.449534 0.016719 -0.490613 -0.359435 0.162305 -0.670529 -0.810057 0.491629 -0.400791 -0.349402 0.383017 -0.342606 -0.340586 0.212910 0.230477 0.197339 0.215781 0.215382 0.216712 0.222136 0.238491 0.239702 0.257708 0.299647 0.226715 0.284835 0.283465 0.283036
chargesum: 0.00000
title: Mulliken charges with hydrogens summed into heavy atoms:
elementType: O O N N N C C C C C C C C C C C
charge: -0.233182 -0.230033 -0.001236 -0.149888 0.016719 -0.047226 0.053684 0.162305 -0.016299 -0.074156 0.491629 -0.174076 -0.064566 0.383017 -0.059142 -0.057550
polarizability: 3.30647446e+02 -1.76886966e+01 1.45032328e+02 1.22728282e+01 1.53920895e+01 8.85189135e+01
1716.lowfreq: -16.4846 -4.7189 -0.0011 -0.0007 -0.0007 1.5095 32.0340 35.6615 56.6530
frequency: 31.2756 35.2775 56.5752 68.9756 78.4728 87.7127 114.3648 133.0732 168.4820 200.7613 224.2328 249.2556 282.9888 312.0815 321.6293 382.5429 414.7108 424.9903 470.4621 495.5119 499.9232 537.2343 547.1977 586.8672 627.5204 650.6419 666.3234 732.7321 744.9450 779.5778 814.9345 823.2158 854.4540 862.7033 864.0960 896.9461 975.9172 976.2957 990.8896 999.9869 1004.4726 1041.7626 1058.2328 1083.1713 1096.5618 1111.2169 1126.8431 1169.4588 1215.4352 1228.7770 1250.2084 1263.3681 1282.7456 1305.7615 1322.6118 1342.0056 1348.5911 1385.4673 1391.1055 1394.3876 1443.8742 1451.9111 1459.5816 1468.0413 1474.0025 1478.0716 1484.5312 1486.2626 1522.0226 1588.5513 1597.6515 1620.5899 2955.0292 2967.8873 2979.4274 2982.5380 3025.1066 3028.5221 3061.1802 3079.2351 3080.0572 3104.3179 3127.4367 3175.5053 3183.2577 3196.7809 3441.5170
redmass: 3.9264 4.5300 4.5480 2.4592 5.4606 3.7426 1.1759 3.4607 1.5565 3.5788 5.2290 1.9631 4.9595 4.0412 3.7464 2.4981 2.7080 3.0489 2.2302 4.1480 4.1046 3.4028 2.7154 2.0626 7.0375 5.4947 4.8857 4.6932 2.1567 4.1301 2.0446 1.3525 2.1807 1.5446 3.9975 1.5144 1.7808 1.3327 2.8922 1.3261 1.4568 2.2830 1.9378 2.1752 3.0968 1.3013 2.2668 1.3389 1.3791 5.3822 1.4449 2.0524 1.3785 1.7404 1.4567 2.1319 3.1865 1.2442 1.2683 3.5515 3.3623 1.1940 1.2433 1.0643 1.0449 1.0494 1.1651 1.7647 2.2717 5.3892 7.5374 6.5205 1.0403 1.0629 1.0497 1.0482 1.0976 1.0998 1.0972 1.1000 1.0999 1.0947 1.0903 1.0892 1.0945 1.0961 1.0747
irintensity: 0.3479 0.0420 0.1169 0.5024 0.7728 1.1238 0.7268 4.3872 0.7197 2.1411 0.7886 2.1767 0.4023 2.5082 4.5868 0.8569 7.6824 4.2429 24.6604 13.4699 8.9474 4.6844 16.1329 32.8055 3.0662 1.0379 25.8526 2.6933 6.1813 9.7338 10.3294 23.0714 1.7035 60.4295 6.2463 6.1435 25.5709 1.6714 0.6696 0.0712 2.3934 46.8824 6.9102 4.1933 16.4062 17.1759 173.3558 209.2768 5.7625 722.2807 8.0013 58.8662 23.8134 60.7938 10.3476 39.1584 46.9606 26.4827 18.0328 75.3442 5.7694 20.3073 38.7211 5.7653 17.8163 16.4906 1.0092 47.9297 98.5305 18.3171 2.0821 520.2167 21.2793 19.1405 74.5013 22.0356 16.2269 25.9812 13.0480 70.4722 50.8768 17.0370 12.7376 0.3386 1.9208 0.8588 41.0641
temp: 298.150 k
press: 1.00000 atm
elementType: 8 8 7 7 7 6 6 6 6 6 6 6 6 6 6 6 1 1 1 1 1 1 1 1 1 1 1 1 1 1 1
symmnumber: 1
zpe: 651192.3 jmol-1
zpe.correction: 0.248026 hartree
zpe.thermalcorrener: 0.264356 hartree
zpe.thermalcorrenthalpy: 0.265300 hartree
zpe.thermalcorrgfe: 0.202442 hartree
zpe.sumelectzpe: -741.572178 hartree
zpe.sumelectthermal: -741.555848 hartree
zpe.sumelectthermalent: -741.554904 hartree
zpe.sumelectthermalfe: -741.617762 hartree
dipole: -9.8265 3.5966 0.3172
dipole: 10.4689
quadrupole: -122.5599 -87.5798 -96.6646
quadrupole: 2.3308 -0.1023 2.1409
quadrupole: -20.2918 14.6883 5.6035 2.3308 -0.1023 2.1409
hfenergy: -741.8202041 hartree
pointgroup: C01 [X(C11H15N3O2)]
dipole: -3.8649033 1.4225826 0.0554057 debye
polarizability: 330.6064486|-17.2429868|146.3979644|13.2273268|12.6128926|87.1942741 unknown
InChI: InChI=1S/C11H15N3O2/c1-3-4-9(2)12-13-10-5-7-11(8-6-10)14(15)16/h5-8,13H,3-4H2,1-2H3
charge 0 multiplicity 1
31 atoms
O  5.276146 0.422942 0.472694
O  4.743929 -1.695638 -0.198717
N  -2.040105 0.075112 -0.449385
N  -1.06039 0.991561 -0.083878
N  4.41657 -0.480234 0.113422
C  -4.337328 -0.550853 -0.860155
C  -5.287303 -0.942549 0.310955
C  -3.296689 0.479547 -0.473139
C  -4.560484 -1.673945 1.459305
C  -3.746867 1.892108 -0.131026
C  0.280922 0.607667 -0.045756
C  1.26321 1.568598 0.340641
C  0.682903 -0.71923 -0.381675
C  3.000143 -0.10674 0.058094
C  2.617533 1.214876 0.393118
C  2.037561 -1.071793 -0.32874
H  -4.948129 -0.151929 -1.696337
H  -3.815377 -1.453072 -1.226576
H  -5.792319 -0.036368 0.70213
H  -6.086276 -1.591386 -0.097507
H  -5.261446 -1.928454 2.274789
H  -4.10001 -2.61238 1.099484
H  -3.751469 -1.052626 1.884166
H  -3.260223 2.645672 -0.78366
H  -3.514821 2.159918 0.920312
H  -4.834724 1.997031 -0.262936
H  -1.301335 1.957102 0.170845
H  0.957861 2.589835 0.59915
H  -0.08226 -1.440261 -0.675237
H  3.386384 1.934071 0.686846
H  2.37199 -2.081684 -0.580526
