program: Gaussian 09
title: 000284991
version: EM64L-G09RevD.01
frameworkgroup: C1[X(C8H6Cl2N2)]
method: RPBEPBE
basis: SDD
operation: Freq
keyword: #p
keyword: freq=noraman
keyword: PBEPBE/SDD
title: #p freq=noraman PBEPBE/SDD
converged: NO NO NO NO
title: Mulliken charges:
elementType: Cl Cl N N C C C C C C C C H H H H H H
charge: 0.003083 0.003132 -0.417846 -0.007576 0.535303 -0.460572 -0.362531 -0.323151 -0.297307 0.642432 -0.632597 -0.235300 0.253085 0.272633 0.313204 0.240809 0.232472 0.240727
chargesum: 0.00000
title: Mulliken charges with hydrogens summed into heavy atoms:
elementType: Cl Cl N N C C C C C C C C
charge: 0.003083 0.003132 -0.104641 -0.007576 0.535303 -0.207487 -0.089898 -0.323151 -0.297307 0.642432 0.081411 -0.235300
polarizability: 1.91854704e+02 9.80067596e+00 1.33858820e+02 4.46199998e-02 9.69191553e-03 4.98089284e+01
1716.lowfreq: -7.0580 -0.0032 -0.0023 -0.0021 8.9026 10.5760 65.1060 96.9812 133.6760
frequency: 65.0655 96.9792 133.6705 157.0261 160.6866 182.7253 183.7033 212.3640 264.3188 312.6477 343.9059 386.1421 418.9656 421.2664 493.6850 522.0225 534.4983 619.5801 623.0686 701.4185 736.3562 771.0966 845.6436 854.4675 900.4007 1039.5531 1083.0636 1122.4029 1154.6692 1200.9413 1217.5781 1306.8410 1352.6784 1417.8626 1441.7088 1458.7188 1471.5173 1495.2393 1516.7108 1550.4328 1626.9541 2172.7632 2961.5293 3031.6747 3107.4669 3149.2685 3182.1996 3584.3807
redmass: 8.5842 4.4330 14.2357 2.1528 4.3863 16.3315 1.6476 3.8304 4.3144 5.1240 19.2209 12.4974 7.1865 1.2004 10.0377 4.9523 5.1465 3.0466 6.4665 5.6347 4.2105 11.0203 1.3711 1.9511 5.3746 3.1786 2.9400 1.2806 2.0042 1.5869 2.1321 2.4387 3.6271 3.4945 1.4993 1.8427 1.0403 1.2823 2.8370 3.2707 7.1994 12.6209 1.0373 1.1016 1.0969 1.0926 1.0919 1.0776
irintensity: 0.1774 1.5883 1.2329 0.0957 0.2739 0.0570 0.1659 3.9391 1.2585 1.0763 1.2174 5.3668 1.3269 101.7687 10.6003 2.6363 0.3585 2.4254 4.7363 12.9219 14.0122 74.8603 0.2000 58.1661 10.4022 29.9844 23.2220 1.3019 11.7935 8.3093 2.3236 13.2724 69.0018 4.8689 9.9630 56.4856 15.7159 2.4170 118.7476 88.2981 599.2977 63.0448 77.2502 38.8845 19.2811 2.3602 1.5392 70.3932
temp: 298.150 k
press: 1.00000 atm
elementType: 17 17 7 7 6 6 6 6 6 6 6 6 1 1 1 1 1 1
symmnumber: 1
zpe: 320526.6 jmol-1
zpe.correction: 0.122082 hartree
zpe.thermalcorrener: 0.133858 hartree
zpe.thermalcorrenthalpy: 0.134802 hartree
zpe.thermalcorrgfe: 0.083648 hartree
zpe.sumelectzpe: -1337.204760 hartree
zpe.sumelectthermal: -1337.192984 hartree
zpe.sumelectthermalent: -1337.192040 hartree
zpe.sumelectthermalfe: -1337.243194 hartree
dipole: -9.1794 -2.5347 0.0003
dipole: 9.5230
quadrupole: -81.0672 -80.6201 -85.6541
quadrupole: 0.5514 -0.0406 -0.0086
quadrupole: 1.3799 1.8271 -3.2070 0.5514 -0.0406 -0.0086
hfenergy: -1337.3268423 hartree
pointgroup: C01[X(C8H6Cl2N2)]
dipole: -3.7148651 -0.4751543 0.1057716 debye
dipolederiv: -0.1464243 -0.1668857 -0.0061436 -0.1804879 -0.6707305 -0.0344217 -0.0070394 -0.0349949 -0.026702 -0.2725036 0.280833 0.0272006 0.291109 -0.5508418 -0.0446091 0.0277824 -0.0443119 -0.0298685 -1.80023 0.0369513 0.0507055 -0.2117609 -0.2966447 0.0195864 0.0327383 0.0099514 -0.4848584 -0.5580432 -0.0280518 0.0095249 -0.0461871 -0.2160259 0.0033252 0.0081363 0.0026647 -0.2421441 1.8487322 0.1021741 -0.055286 0.3713711 0.2670072 -0.0078061 -0.0384575 0.0022438 0.1696797 -0.8384911 0.0607064 0.0279569 0.4456615 -0.1999409 -0.0173156 0.0532083 -0.0032044 -0.1874635 -0.6939303 -0.1001978 0.0118422 -0.6068746 -0.3337454 0.0138347 -0.0207402 -0.0050625 -0.199361 0.842393 0.1313324 -0.0244034 0.1081776 1.0852186 0.0680187 -0.0257966 0.0674009 -0.0470936 0.906248 -0.2399378 -0.0505875 -0.1408121 0.9947368 0.0729181 -0.044192 0.0766422 -0.0434619 -0.6529222 0.0378393 0.0306228 -0.0082171 -0.5514405 -0.0424878 0.0275332 -0.0441595 0.1128161 0.4891978 -0.1276381 -0.0163483 -0.4500034 0.3356568 0.0210672 -0.0368154 0.008958 0.2784414 0.6613873 0.0588006 -0.018544 0.0858155 0.0129909 -0.00452 -0.0167846 -0.0035858 0.0360771 0.0338017 -0.0648889 0.0010384 -0.0544797 -0.0111691 -0.0101508 0.0020047 -0.0097864 0.1769594 0.0386022 0.0578458 0.0086243 0.0673296 0.0278463 -0.0119451 0.0094581 -0.0113479 0.1750671 0.1614097 0.0490168 0.0098397 0.1404598 0.1081395 -0.0197842 0.0161617 -0.0160182 0.3318988 0.0544928 -0.0231716 -0.0615207 0.1489037 -0.010276 -0.1006975 0.0446073 -0.1050757 -0.0888799 -0.1295962 -0.0427596 0.0071035 -0.1212427 0.0471787 -0.0009954 0.0020837 -0.0039603 0.1312302 0.0558763 -0.0219683 0.0483745 0.1612377 -0.0379602 0.095983 -0.0338882 0.1136467 -0.062337 unknown
polarizability: 193.256309|1.4704663|131.9358438|-5.117652|5.2220143|50.3302992 unknown
InChI: InChI=1S/C8H6Cl2N2/c1-12-5-2-7(9)6(4-11)8(10)3-5/h2-3,12H,1H3
charge 0 multiplicity 1
18 atoms
Cl 0.918589 2.822496 0.161577
Cl 1.656675 -2.695443 -0.218971
N  -3.055902 -0.541528 0.092556
N  3.772446 0.399544 -0.092444
C  -1.687177 -0.335978 0.054958
C  -0.802577 -1.455241 -0.04936
C  -1.13048 0.97686 0.118584
C  0.259818 1.14267 0.078856
C  0.578443 -1.252359 -0.086177
C  1.167046 0.048549 -0.023452
C  -4.042986 0.534402 0.201808
C  2.585856 0.240409 -0.061031
H  -1.204337 -2.472649 -0.100335
H  -1.772931 1.856315 0.19775
H  -3.39296 -1.501707 0.043588
H  -3.914303 1.115317 1.136211
H  -5.052731 0.094553 0.211406
H  -3.983391 1.234392 -0.654725
