program: Gaussian 09
title: 000284985
version: EM64L-G09RevD.01
frameworkgroup: C1[X(C15H12N2)]
method: RPBEPBE
basis: SDD
operation: Freq
keyword: #pfreq=noraman
keyword: PBEPBE/SDD
title: #p freq=noraman PBEPBE/SDD
converged: YES YES NO YES
title: Mulliken charges:
elementType: N N C C C C C C C C C C C C C C C H H H H H H H H H H H H
charge: -0.482916 0.008695 0.175823 0.239850 0.448269 0.187931 0.305830 -0.569462 -0.596600 0.220826 -0.589428 -0.488996 -0.476558 -0.394711 -0.371062 -0.253235 -0.214621 0.218607 0.232613 0.244221 0.242775 0.306214 0.222182 0.229888 0.235508 0.235569 0.233652 0.224505 0.224633
chargesum: 0.00000
title: Mulliken charges with hydrogens summed into heavy atoms:
elementType: N N C C C C C C C C C C C C C C C
charge: -0.176703 0.008695 0.175823 0.239850 0.448269 0.187931 0.305830 -0.118242 -0.352380 0.220826 -0.346652 -0.036926 -0.241050 -0.159142 -0.137410 -0.028730 0.010012
polarizability: 3.25933817e+02 -4.26709180e+00 1.70144342e+02 -3.38544692e-01 -2.06668834e+00 7.68346585e+01
1716.lowfreq: -6.2570 -0.0006 0.0003 0.0006 2.0498 5.9442 63.5360 92.5296 140.7455
frequency: 63.5338 92.5277 140.7448 150.4699 195.0115 230.8758 303.0878 319.2264 335.5414 352.3188 424.9999 447.2474 458.2088 480.0040 508.8020 531.4374 541.0805 571.4108 590.1331 614.8149 667.7127 705.4791 720.4612 743.4732 754.5443 767.4354 777.6045 791.7681 843.3971 855.9801 862.7958 871.3707 888.1653 923.1848 936.3663 939.7218 971.4764 974.7512 1006.9535 1017.6019 1055.1661 1106.6582 1141.1333 1166.5264 1174.3654 1186.1842 1209.5514 1222.1531 1232.7847 1253.7597 1260.9817 1305.4486 1316.4309 1332.8971 1353.0311 1362.2582 1399.1852 1419.1894 1446.3093 1447.3537 1454.0878 1468.8214 1482.5526 1494.2098 1563.5024 1590.8975 1599.6832 1622.7358 1642.9287 2956.3530 2965.0923 3038.2272 3052.2768 3062.1264 3125.7252 3127.7521 3128.6310 3135.4600 3148.3863 3166.0611 3609.2309
redmass: 4.7408 3.7529 3.2259 5.1978 3.8701 2.9450 4.6024 4.9365 4.4625 4.5425 2.7588 2.9976 2.7816 6.2621 1.1393 4.8195 4.7271 3.7613 5.2935 6.4448 3.9121 4.8636 3.6415 2.1986 1.9767 3.3262 2.7787 4.2031 4.4735 1.4570 3.9021 1.4700 1.4215 2.9889 1.4023 1.6982 3.7234 1.3120 2.6694 1.9920 2.0919 1.9499 2.2191 1.1342 1.2906 1.6019 1.8918 1.6280 1.3404 3.2411 1.5584 1.4000 2.0477 1.8282 1.4599 1.8169 3.6869 3.8406 1.1280 3.1482 1.1891 2.7819 4.2441 4.3891 7.1849 6.4607 7.4578 6.9370 7.9597 1.0685 1.0641 1.0946 1.0949 1.0901 1.0914 1.0855 1.0920 1.0894 1.0953 1.1002 1.0802
irintensity: 0.4818 0.8354 1.0278 0.1707 1.0392 1.5003 0.4481 4.9137 1.0250 3.4240 13.2572 2.5705 5.2326 0.4221 95.0787 1.8405 15.0918 2.0258 2.8173 7.4661 5.2482 11.8980 3.8094 39.4048 53.2235 19.1085 14.8596 2.6580 16.0135 0.1145 4.3788 27.5983 3.5188 2.1773 7.2293 15.0722 2.0151 0.0012 5.9825 11.2933 7.3144 8.4493 27.1536 2.4975 1.9917 7.1156 9.3383 8.1290 6.7135 101.2712 4.3626 10.9824 8.6655 53.3988 32.9713 26.0308 1.5172 7.0887 11.1670 26.3519 4.0189 12.4968 74.7417 9.2433 48.2117 2.1498 53.5127 96.2707 27.2532 33.9982 46.3579 41.3670 49.9927 32.9159 16.2101 3.9169 1.5609 2.6728 30.3436 34.8472 54.9693
temp: 298.150 k
press: 1.00000 atm
elementType: 7 7 6 6 6 6 6 6 6 6 6 6 6 6 6 6 6 1 1 1 1 1 1 1 1 1 1 1 1
symmnumber: 1
zpe: 605297.4 jmol-1
zpe.correction: 0.230546 hartree
zpe.thermalcorrener: 0.242731 hartree
zpe.thermalcorrenthalpy: 0.243675 hartree
zpe.thermalcorrgfe: 0.192349 hartree
zpe.sumelectzpe: -687.163206 hartree
zpe.sumelectthermal: -687.151021 hartree
zpe.sumelectthermalent: -687.150077 hartree
zpe.sumelectthermalfe: -687.201403 hartree
dipole: -2.7546 -3.6258 -0.0169
dipole: 4.5535
quadrupole: -103.0857 -83.7204 -104.2800
quadrupole: -8.1640 -0.4213 -1.0151
quadrupole: -6.0570 13.3083 -7.2513 -8.1640 -0.4213 -1.0151
hfenergy: -687.393752 hartree
pointgroup: C01 [X(C15H12N2)]
dipole: 1.0951696 -1.4177529 0.0028984 debye
polarizability: 325.8525775|5.5077335|170.1930538|0.8671351|2.6820263|76.8671862 unknown
InChI: InChI=1S/C15H12N2/c1-2-4-14-12(3-1)13-7-11-9-16-6-5-10(11)8-15(13)17-14/h1-4,7-9,17H,5-6H2
charge 0 multiplicity 1
29 atoms
N  1.427034 -1.771892 -0.02946
N  -4.389528 1.210294 -0.14075
C  0.439167 0.307816 0.048505
C  0.192349 -1.110578 0.020513
C  -2.200159 -0.754781 0.097326
C  1.88744 0.487852 0.015412
C  -1.973731 0.665548 0.111662
C  -3.646031 -1.214712 0.215977
C  -1.114629 -1.647726 0.049429
C  2.470469 -0.826158 -0.032695
C  -0.65978 1.190488 0.09723
C  -4.605848 -0.226841 -0.490734
C  -3.151659 1.55917 0.124496
C  2.734823 1.620221 0.020706
C  3.86529 -1.026695 -0.074509
C  4.132551 1.42944 -0.020889
C  4.689307 0.120448 -0.067908
H  -3.778212 -2.234725 -0.190042
H  -3.915526 -1.25928 1.292784
H  -1.287806 -2.730082 0.043509
H  -0.509481 2.27673 0.113441
H  1.551228 -2.781287 -0.056984
H  -4.497641 -0.31157 -1.593549
H  -5.655306 -0.472657 -0.25141
H  -2.978746 2.624702 0.345718
H  2.31552 2.631785 0.056507
H  4.301455 -2.030889 -0.110983
H  4.800698 2.297236 -0.017123
H  5.777851 -0.000256 -0.099678
