program: Gaussian 09
title: 000284971
version: EM64L-G09RevD.01
frameworkgroup: C1[X(C10H10Br4)]
method: RPBEPBE
basis: SDD
operation: Freq
keyword: #p
keyword: freq=noraman
keyword: PBEPBE/SDD
title: #p freq=noraman PBEPBE/SDD
converged: NO YES NO NO
title: Mulliken charges:
elementType: Br Br Br Br C C C C C C C C C C H H H H H H H H H H
charge: -0.018513 -0.018513 -0.018512 -0.018513 0.435344 0.435344 0.435344 0.435345 -0.506010 -0.506010 -0.899447 -0.899447 -0.899448 -0.899448 0.245514 0.245513 0.312348 0.300517 0.312348 0.300516 0.300517 0.312348 0.300517 0.312348
chargesum: 0.00000
title: Mulliken charges with hydrogens summed into heavy atoms:
elementType: Br Br Br Br C C C C C C C C C C
charge: -0.018513 -0.018513 -0.018512 -0.018513 0.435344 0.435344 0.435344 0.435345 -0.260496 -0.260497 -0.286583 -0.286583 -0.286583 -0.286583
polarizability: 2.47397526e+02 1.71020474e-02 2.06624913e+02 -2.20253433e-03 -1.15975533e+01 1.19969263e+02
1716.lowfreq: -7.2713 -2.6594 -2.5126 -0.0003 0.0004 0.0004 22.5888 25.2460 28.2533
frequency: 22.5888 25.2460 28.2205 35.8481 63.2589 68.6077 82.1994 82.4949 161.4573 206.5788 234.4963 288.7654 298.0356 323.6178 329.7258 431.0834 454.2021 476.3593 508.4555 520.9978 548.7016 570.3538 606.9307 700.3236 725.1868 733.0899 782.0500 801.7702 876.0003 879.5197 914.8330 915.1063 915.6846 917.9418 1081.6117 1095.7241 1106.3385 1108.2276 1129.7890 1211.9444 1212.0190 1212.4529 1217.1546 1224.5382 1225.4839 1291.9592 1297.5482 1391.9567 1405.6248 1458.9632 1463.1431 1479.7630 1480.1871 1503.3682 1568.1570 1616.5087 3071.7462 3071.7951 3073.2314 3073.4865 3124.9525 3127.9845 3154.2119 3154.4452 3157.3368 3157.6754
redmass: 43.1089 33.2443 54.6319 18.7314 7.7533 8.0506 18.3476 5.5052 8.0421 7.3208 5.5050 2.4028 2.2945 2.4321 8.7452 3.6183 3.6323 8.4078 3.2543 5.6046 6.3689 4.1872 6.1024 4.4532 6.7843 5.4469 2.9944 2.5105 1.5383 1.3698 1.4862 1.6586 1.6631 1.4903 1.2914 3.1073 1.0691 1.1250 1.3055 1.1245 1.5165 1.1341 3.5618 1.1472 1.1699 6.3359 1.2566 6.6398 4.0313 1.1189 1.2376 1.1127 1.1204 3.1395 7.7846 6.7744 1.0576 1.0576 1.0577 1.0578 1.0916 1.0922 1.1113 1.1111 1.1108 1.1108
irintensity: 0.0004 0.2519 0.0000 1.4022 5.5938 0.0000 0.0000 0.0000 17.2429 11.9299 0.0000 0.9650 0.0001 1.7261 0.0000 16.3354 0.0000 87.4086 0.0000 0.0001 0.0003 124.8662 0.0000 53.6973 13.2426 0.0000 0.0000 58.1130 4.5210 0.0000 0.0000 5.1112 0.0000 20.0216 2.5156 0.0000 0.0000 2.4291 0.0000 82.6030 105.5884 0.0018 23.0411 11.9970 0.0000 0.0000 0.0000 7.5414 4.9122 0.0000 33.3520 9.8834 0.0000 0.0351 0.0000 0.0000 0.0010 28.0465 4.5306 0.0009 13.8772 0.0003 0.0000 2.5264 0.3536 0.0000
temp: 298.150 k
press: 1.00000 atm
elementType: 35 35 35 35 6 6 6 6 6 6 6 6 6 6 1 1 1 1 1 1 1 1 1 1
symmnumber: 1
zpe: 451465.0 jmol-1
zpe.correction: 0.171954 hartree
zpe.thermalcorrener: 0.187591 hartree
zpe.thermalcorrenthalpy: 0.188535 hartree
zpe.thermalcorrgfe: 0.121836 hartree
zpe.sumelectzpe: -439.886545 hartree
zpe.sumelectthermal: -439.870908 hartree
zpe.sumelectthermalent: -439.869964 hartree
zpe.sumelectthermalfe: -439.936663 hartree
dipole: 0.0000 0.0000 0.0000
dipole: 0.0000
quadrupole: -135.1737 -136.6087 -110.5967
quadrupole: -0.0001 0.0000 7.9625
quadrupole: -7.7140 -9.1490 16.8630 -0.0001 0.0000 7.9625
hfenergy: -440.058499 hartree
pointgroup: C01 [X(C10H10Br4)]
dipole: 0.0000015 -0.0000004 -0.0000005 debye
dipolederiv: -0.4633617 0.2663926 0.066567 0.3789444 -0.4403131 -0.0979193 0.3371137 -0.2736563 -0.2515075 -0.4631591 -0.2656996 -0.0662539 -0.3789756 -0.4404495 -0.0978851 -0.3369092 -0.2726071 -0.2510544 -0.4631953 -0.2661965 -0.0664443 -0.3789272 -0.4400679 -0.0977576 -0.3369977 -0.2737347 -0.2514851 -0.4634325 0.2654768 0.0662175 0.3789369 -0.4402138 -0.0978679 0.3372205 -0.2722903 -0.2509879 -0.0671945 0.0034638 0.0185008 0.0528825 -0.0324978 -0.0205377 -0.1393513 0.0653421 -0.0914452 -0.0673306 -0.0037125 -0.0185687 -0.0528363 -0.032317 -0.0204507 0.1392612 0.0653749 -0.0914786 -0.0672778 -0.0033497 -0.0184526 -0.0528595 -0.0326899 -0.0205955 0.1392421 0.0653504 -0.0914706 -0.067184 0.0034564 0.0184887 0.0528963 -0.0322081 -0.0204239 -0.1393374 0.0653225 -0.0914683 -0.232734 -0.0000255 0.0000279 -0.0000132 0.0095896 -0.1068151 0.0000175 -0.0633013 -0.0341152 -0.2327054 0.0002732 0.0001384 -0.0000073 0.0097433 -0.1067488 0.0000086 -0.0634032 -0.0341546 0.587506 -0.4576553 -0.1791578 -0.4949138 0.4758763 0.2092659 -0.2931772 0.2797683 0.3524016 0.5873307 0.4565351 0.1786221 0.4949128 0.4754065 0.2090166 0.293102 0.2778249 0.3516556 0.5873484 0.457101 0.178861 0.4949211 0.4755179 0.2090521 0.2932861 0.2796558 0.3523152 0.5876162 -0.4560457 -0.1785318 -0.494977 0.4751387 0.208999 -0.2934201 0.2773205 0.3515201 0.0780263 0.000018 -0.0000132 -0.0000098 -0.037188 0.0779289 0.0000062 0.0865678 0.068895 0.0780272 0.0000334 -0.0000075 -0.0000681 -0.0375951 0.0777983 0.0000598 0.0870114 0.0690475 -0.0295766 0.0434374 0.016668 -0.0173489 0.0200849 -0.0826987 0.0458461 -0.0981514 0.0284009 0.0500097 -0.0079199 0.1033807 0.0724718 -0.00915 0.0064023 0.0548929 0.0150967 -0.0552187 -0.0296075 -0.0437644 -0.0167245 0.0173566 0.0205012 -0.0825703 -0.0458271 -0.097984 0.0284605 0.049981 0.0079999 -0.1033686 -0.0724327 -0.0093024 0.0063371 -0.0549965 0.0155734 -0.0550431 0.0499854 0.0080308 -0.1033582 -0.0724024 -0.0091243 0.0063921 -0.0550483 0.0152063 -0.0551614 -0.0295435 -0.0433901 -0.0166149 0.0173039 0.0201381 -0.0826825 -0.0458494 -0.0980892 0.0284332 0.0499952 -0.0080919 0.1033164 0.0724309 -0.0093816 0.0063321 0.0549865 0.0158181 -0.054978 -0.0295237 0.0436328 0.0167074 -0.0172854 0.0205019 -0.0825714 0.045871 -0.0980154 0.028439 unknown
polarizability: 247.3975293|-0.0083613|199.5147867|-0.0130521|26.4590561|127.079386 unknown
InChI: InChI=1S/C10H10Br4/c11-3-7-1-8(4-12)10(6-14)2-9(7)5-13/h1-2H,3-6H2
charge 0 multiplicity 1
24 atoms
Br -3.325886 2.450221 0.646828
Br -3.3252 -2.451181 -0.646601
Br 3.325215 2.451214 0.646621
Br 3.325905 -2.450186 -0.646812
C  -1.239066 0.607522 -0.377234
C  -1.238857 -0.607867 0.377329
C  1.238874 0.6079 -0.377313
C  1.239083 -0.60749 0.37725
C  -0.000196 1.189094 -0.734548
C  0.000213 -1.18906 0.734564
C  -2.511796 1.25861 -0.828232
C  -2.511359 -1.259342 0.828412
C  2.511376 1.259377 -0.828394
C  2.511813 -1.258578 0.828248
H  -0.000358 2.130044 -1.29879
H  0.000375 -2.130011 1.298806
H  -3.317799 0.549114 -1.059856
H  -2.356516 1.957973 -1.660729
H  -3.317559 -0.55009 1.060101
H  -2.355807 -1.958666 1.660891
H  2.355824 1.958702 -1.660872
H  3.317576 0.550125 -1.060083
H  2.356532 -1.957942 1.660743
H  3.317815 -0.549081 1.059873
