program: Gaussian 09
title: 000022751
version: EM64L-G09RevD.01
frameworkgroup: C1[X(C12H13NO2)]
method: RPBEPBE
basis: SDD
operation: Freq
keyword: #p
keyword: freq=noraman
keyword: PBEPBE/SDD
title: #p freq=noraman PBEPBE/SDD
converged: YES YES NO NO
title: Mulliken charges:
elementType: O O N C C C C C C C C C C C C H H H H H H H H H H H H H
charge: -0.412494 -0.236567 -0.410856 0.007742 0.080642 0.314733 0.375800 0.394648 -0.399082 -0.619389 -0.463698 -0.433079 -0.870689 -0.831006 0.201416 0.314633 0.271633 0.244606 0.243451 0.222098 0.223209 0.228221 0.278666 0.215297 0.223395 0.223482 0.238403 0.374784
chargesum: 0.00000
title: Mulliken charges with hydrogens summed into heavy atoms:
elementType: O O N C C C C C C C C C C C C
charge: -0.037710 -0.236567 -0.096223 0.007742 0.080642 0.314733 0.375800 0.394648 -0.127449 -0.131332 -0.241601 -0.209870 -0.148505 -0.145726 0.201416
polarizability: 1.77630957e+02 4.59492767e+00 1.63639526e+02 -1.19164632e+01 -3.89546809e+00 8.45495958e+01
1716.lowfreq: -5.3753 -0.0004 0.0005 0.0008 8.4899 8.9660 33.8929 55.5197 68.4807
frequency: 33.8241 55.5160 68.4767 118.9948 136.4994 141.7971 193.7269 219.2589 227.1249 261.2562 302.6133 312.6943 355.2706 403.9544 441.8757 473.4379 499.1384 537.6974 545.2126 549.8620 582.8808 598.2369 617.4547 645.0512 677.9863 732.6990 759.8280 781.6961 800.9731 813.6905 849.1156 920.5620 927.6693 930.0009 955.7312 1014.3666 1043.5436 1044.5872 1050.2759 1066.3924 1121.9513 1136.0941 1168.4890 1187.4243 1251.7590 1265.7189 1278.0795 1296.5415 1314.7152 1353.1205 1376.5701 1385.3182 1397.8638 1406.3144 1432.4391 1453.9004 1471.6530 1474.7061 1480.8373 1498.8579 1518.3312 1555.8232 1597.7444 1624.1733 1661.1326 2956.3377 2965.3329 3024.8603 3039.2275 3045.6972 3079.6668 3083.9640 3109.1859 3115.9519 3139.9038 3224.1555 3508.3070 3615.1224
redmass: 9.3613 5.8483 4.9230 1.2421 2.5754 3.3529 3.5627 1.7772 1.6269 2.9640 3.0895 3.8505 4.4119 2.2660 4.9164 3.9621 1.4429 3.7589 2.2492 3.2270 3.0874 2.5788 3.1014 2.5609 3.1617 4.9352 4.0768 3.3877 2.1653 1.2362 5.1954 2.1021 2.2865 1.4052 2.3509 1.6882 1.5365 1.9664 1.5329 2.0607 1.5059 1.8963 2.0618 1.5463 1.9277 1.6884 1.5511 2.3837 2.2356 2.6486 3.9195 3.0416 1.3259 1.2707 3.3386 1.1370 1.0454 1.0900 1.0925 1.1015 3.5235 5.9178 6.9572 6.7023 8.3351 1.0389 1.0390 1.0977 1.0603 1.0951 1.0988 1.0958 1.1019 1.0870 1.0958 1.0987 1.0639 1.0807
irintensity: 1.1183 0.4042 0.2669 1.1731 0.5849 1.0186 0.1696 5.0529 8.0929 0.2821 2.2622 0.6654 0.3662 4.5083 0.0547 13.7885 64.4076 26.6931 49.2643 12.7525 9.1905 31.9689 25.2758 46.7785 70.0154 2.2420 4.5064 10.5767 26.1746 27.7855 26.4005 16.7423 9.9669 1.3994 1.6935 8.8239 4.5277 79.1712 8.5720 154.8254 22.1803 30.8654 18.7253 13.9699 3.0729 3.6051 6.2242 8.5130 58.1241 17.9507 17.8289 42.3225 4.2342 12.8137 1.2101 20.7463 13.9605 8.6610 14.2936 18.6907 19.4013 2.5985 0.5869 1.9759 203.3022 56.1228 32.6025 27.7372 17.6571 20.0661 15.9020 18.4317 2.9681 15.4577 31.0850 0.3301 21.6999 55.8081
temp: 298.150 k
press: 1.00000 atm
elementType: 8 8 7 6 6 6 6 6 6 6 6 6 6 6 6 1 1 1 1 1 1 1 1 1 1 1 1 1
symmnumber: 1
zpe: 588013.9 jmol-1
zpe.correction: 0.223963 hartree
zpe.thermalcorrener: 0.238014 hartree
zpe.thermalcorrenthalpy: 0.238958 hartree
zpe.thermalcorrgfe: 0.182737 hartree
zpe.sumelectzpe: -669.218668 hartree
zpe.sumelectthermal: -669.204616 hartree
zpe.sumelectthermalent: -669.203672 hartree
zpe.sumelectthermalfe: -669.259893 hartree
dipole: 0.8178 -3.3744 0.4770
dipole: 3.5047
quadrupole: -79.8791 -78.8361 -89.5000
quadrupole: 0.3022 -2.1485 3.2385
quadrupole: 2.8593 3.9023 -6.7616 0.3022 -2.1485 3.2385
hfenergy: -669.4426303 hartree
pointgroup: C01 [X(C12H13N1O2)]
dipole: -0.2928526 -1.3299743 -0.2159865 debye
polarizability: 177.4495237|-3.8675875|163.1997836|-13.5389174|5.6027493|85.1707716 unknown
InChI: InChI=1S/C12H13NO2/c1-7-3-4-8(2)12-11(7)9(6-13-12)5-10(14)15/h3-4,6,13-14H,5H2,1-2H3
charge 0 multiplicity 1
28 atoms
O  3.815688 -1.116945 0.582587
O  3.236389 1.092847 0.989866
N  -0.827655 -1.976069 -0.285679
C  -0.270026 0.247563 -0.322243
C  -1.339001 -0.687429 -0.082253
C  0.903424 -0.544565 -0.679095
C  -0.532231 1.649833 -0.187176
C  -2.655993 -0.315468 0.289429
C  0.520041 -1.886372 -0.641974
C  2.313129 -0.080533 -1.000246
C  -1.840396 2.020467 0.188225
C  -2.876409 1.068848 0.42137
C  0.523274 2.711832 -0.439107
C  -3.737777 -1.351883 0.525971
C  3.142455 0.075535 0.268678
H  -1.357217 -2.838933 -0.18818
H  1.118561 -2.774208 -0.837479
H  2.303185 0.891891 -1.515726
H  2.813515 -0.817815 -1.649764
H  -2.070431 3.086352 0.3047
H  -3.872682 1.424096 0.711331
H  0.136523 3.712365 -0.17941
H  1.438643 2.533265 0.154545
H  0.819564 2.743622 -1.506301
H  -3.934723 -1.957523 -0.381511
H  -3.465414 -2.05303 1.340368
H  -4.687688 -0.870066 0.811664
H  4.302652 -0.998676 1.443308
