program: Gaussian 09
title: 000284988
version: EM64L-G09RevD.01
frameworkgroup: C1[X(C13H10Cl2INO2S)]
method: RPBEPBE
basis: SDD
operation: Freq
keyword: #p
keyword: freq=noraman
keyword: PBEPBE/SDD
title: #p freq=noraman PBEPBE/SDD
converged: YES YES NO NO
title: Mulliken charges:
elementType: I Cl Cl S O O N C C C C C C C C C C C C C H H H H H H H H H H
charge: 0.188711 -0.014139 -0.014494 1.003408 -0.530495 -0.502337 -0.756278 -0.035499 0.624628 -0.243117 -0.223360 0.452863 -0.392086 -0.338945 -0.360043 -0.430372 -0.795980 0.027415 0.002455 -0.381697 0.358837 0.285091 0.277877 0.248500 0.248890 0.319563 0.267713 0.241313 0.230325 0.241254
chargesum: 0.00000
title: Mulliken charges with hydrogens summed into heavy atoms:
elementType: I Cl Cl S O O N C C C C C C C C C C C C C
charge: 0.188711 -0.014139 -0.014494 1.003408 -0.530495 -0.502337 -0.397441 -0.035499 0.624628 0.041974 0.054517 0.452863 -0.143586 -0.090056 -0.040480 -0.162658 -0.083087 0.027415 0.002455 -0.381697
polarizability: 2.87311631e+02 2.17892464e+01 2.01437048e+02 7.94944209e+00 1.81001197e+01 1.93176418e+02
1716.lowfreq: -12.7926 -2.8732 -0.0017 -0.0005 -0.0003 3.9235 4.5188 8.2473 13.7165
frequency: -12.4932 6.4205 13.4708 37.5505 45.5090 73.7006 80.9757 127.7177 132.5089 139.7282 164.9657 171.2066 176.4129 188.8157 200.1699 230.0338 266.5669 276.4262 297.9489 304.7138 343.9592 370.0999 381.1968 400.8120 407.9941 421.0180 444.0737 470.9261 508.4799 517.0655 579.0563 585.2888 620.2600 627.7634 675.4133 693.7880 706.6204 761.6112 776.4703 809.1506 827.7502 844.9247 851.8100 898.3778 920.7932 953.2360 961.1546 981.4036 986.6180 987.0440 996.0165 1050.1157 1051.2856 1123.0060 1126.1991 1187.4824 1190.5827 1220.1966 1234.5297 1299.2995 1305.5177 1356.3211 1380.7007 1391.9306 1402.1560 1403.0126 1430.6032 1469.6736 1472.3840 1475.2313 1534.3659 1588.7162 1592.8031 1595.0232 2984.8813 3064.3785 3095.9849 3139.6823 3141.8363 3163.4326 3165.7078 3168.1454 3171.0878 3537.8873
redmass: 1.3561 3.9378 4.8142 3.9298 13.3147 8.2644 9.1506 6.0789 6.6690 32.4022 26.5575 16.7134 7.2070 9.5928 6.5339 8.4330 2.8618 11.4346 5.2845 6.2236 1.4794 4.1651 6.7419 7.7365 2.8503 12.3813 8.1944 6.3470 3.3585 5.3157 5.4105 5.4360 6.9883 7.7027 6.9008 3.4083 3.3190 9.9210 5.1715 11.0568 1.3794 1.2498 1.5620 1.4424 7.3169 10.7761 1.3073 1.4014 2.7665 4.1691 2.2231 2.4668 1.5867 1.3218 1.9044 1.1991 1.7023 3.0278 1.6284 1.2662 2.4268 3.6219 4.4390 3.1168 1.3718 2.6856 4.1145 1.0450 2.3328 1.1115 7.7910 6.7742 6.0992 6.6469 1.0377 1.0974 1.0990 1.0895 1.0890 1.0963 1.0926 1.0957 1.0939 1.0783
irintensity: 0.2306 1.4698 0.6186 0.0573 0.1640 1.4023 1.5007 3.1063 1.3150 0.9516 0.2061 0.4895 8.1598 2.3863 1.5335 14.0668 57.3346 0.8096 18.5825 3.8271 64.9718 4.2123 16.5128 11.7642 0.1435 70.9068 11.8376 36.3611 102.2410 0.5416 2.2768 31.5505 1.9465 44.3609 115.4839 14.2037 6.4918 93.1319 18.7670 152.8640 29.6354 0.1691 32.1084 39.3399 51.0394 62.3662 2.4230 0.9169 10.1463 15.4003 4.9593 27.2725 14.2935 14.4470 26.8454 16.5121 19.2682 7.8524 11.9738 3.2558 90.0545 29.5619 2.5296 10.0206 14.8639 43.9612 206.8639 14.6465 21.4073 17.2282 81.9487 212.6980 17.3846 1.8075 19.1306 13.4463 16.3402 8.3665 6.8697 3.3822 2.1638 5.8156 6.2497 77.9387
temp: 298.150 k
press: 1.00000 atm
elementType: 53 17 17 16 8 8 7 6 6 6 6 6 6 6 6 6 6 6 6 6 1 1 1 1 1 1 1 1 1 1
symmnumber: 1
zpe: 518935.1 jmol-1
zpe.correction: 0.197652 hartree
zpe.thermalcorrener: 0.217771 hartree
zpe.thermalcorrenthalpy: 0.218715 hartree
zpe.thermalcorrgfe: 0.143838 hartree
zpe.sumelectzpe: -2034.652247 hartree
zpe.sumelectthermal: -2034.632128 hartree
zpe.sumelectthermalent: -2034.631184 hartree
zpe.sumelectthermalfe: -2034.706061 hartree
dipole: -2.8924 4.2159 -3.9084
dipole: 6.4355
quadrupole: -150.0278 -147.2927 -155.1200
quadrupole: -21.7294 15.6885 7.6130
quadrupole: 0.7857 3.5208 -4.3065 -21.7294 15.6885 7.6130
hfenergy: -2034.8498989 hartree
pointgroup: C01 [X(C13H10Cl2I1N1O2S1)]
dipole: 1.3721268 2.0870076 0.4149949 debye
polarizability: 284.3796949|-25.2515477|187.2679558|14.158675|-13.0235276|210.2774471 unknown
InChI: InChI=1S/C13H10Cl2INO2S/c1-8-2-4-10(5-3-8)20(18,19)17-9-6-11(14)13(16)12(15)7-9/h2-7,17H,1H3
charge 0 multiplicity 1
30 atoms
I  -5.508266 1.22798 -0.27793
Cl -4.201371 0.833683 2.933491
Cl -3.303237 -0.275474 -2.52244
S  1.438608 -2.007391 0.203483
O  2.408545 -2.785648 1.247001
O  0.947886 -2.656732 -1.200003
N  -0.014054 -1.685926 1.26262
C  2.152298 -0.302229 -0.164518
C  -1.213358 -1.058207 0.891287
C  3.029195 0.250669 0.781275
C  1.808409 0.326075 -1.372837
C  3.251932 2.212462 -0.699986
C  3.57656 1.521634 0.497787
C  2.367988 1.596016 -1.626903
C  -1.643096 -0.988893 -0.460096
C  -2.021299 -0.47866 1.90688
C  3.843489 3.577054 -0.99834
C  -3.234057 0.140905 1.561831
C  -2.844476 -0.327403 -0.766634
C  -3.682343 0.252359 0.220484
H  0.158423 -2.015779 2.216706
H  3.293042 -0.299595 1.690162
H  1.151272 -0.166669 -2.095821
H  4.267973 1.978098 1.214548
H  2.118019 2.111716 -2.561022
H  -1.072717 -1.485838 -1.249084
H  -1.706664 -0.503886 2.953944
H  3.049226 4.335029 -1.129616
H  4.507841 3.919986 -0.187991
H  4.431932 3.559364 -1.934376
