program: Gaussian 09
title: 000284962
version: EM64L-G09RevD.01
frameworkgroup: C1[X(C10H12Cl3NO4)]
method: RPBEPBE
basis: SDD
operation: Freq
keyword: #p
keyword: freq=noraman
keyword: PBEPBE/SDD
title: #p freq=noraman PBEPBE/SDD
converged: YES YES NO NO
title: Mulliken charges:
elementType: Cl Cl Cl O O O O N C C C C C C C C C C H H H H H H H H H H H H
charge: 0.091538 0.127790 0.107355 -0.226592 -0.433002 -0.209459 -0.387996 -0.345624 -0.265927 -0.206861 -0.470732 -0.458992 0.232832 -0.182371 -0.181030 0.152819 0.002908 -0.612089 0.279879 0.253640 0.225173 0.242686 0.234482 0.240840 0.204760 0.207539 0.331598 0.300748 0.384144 0.359945
chargesum: 0.00000
title: Mulliken charges with hydrogens summed into heavy atoms:
elementType: Cl Cl Cl O O O O N C C C C C C C C C C
charge: 0.091538 0.127790 0.107355 -0.226592 -0.048859 -0.209459 -0.028051 -0.014027 0.013952 0.046779 -0.002873 0.016330 0.232832 0.022389 0.026509 0.152819 0.303656 -0.612089
polarizability: 1.77083833e+02 9.00002032e-01 1.39643584e+02 7.91569313e+00 -2.31214503e+00 1.39312209e+02
1716.lowfreq: -7.0411 -1.8030 0.0021 0.0028 0.0035 14.9931 22.3036 28.3931 33.4499
frequency: 21.0713 28.3881 33.3975 41.7697 52.3159 69.6936 96.9371 126.6575 153.6839 168.0375 176.3496 196.2665 220.1287 249.6979 266.0571 287.9576 298.9788 314.4042 330.2563 372.1118 374.5725 397.4480 432.2380 468.6608 493.4752 529.1341 548.7259 583.0600 603.9742 624.5801 635.8492 657.2262 697.5069 706.9201 728.1340 758.6347 804.6142 833.7603 880.7295 910.8486 918.8587 931.7571 970.0102 990.2087 997.6786 1004.2918 1014.8657 1049.6144 1066.8487 1088.4667 1125.3602 1141.4028 1175.3719 1197.7409 1211.2716 1242.6001 1248.2879 1257.2123 1291.4435 1311.2445 1320.9396 1336.1965 1342.1268 1353.2204 1354.4485 1383.8851 1447.2736 1455.2228 1467.1143 1632.8323 1664.9650 1687.6208 2969.4370 2973.9628 2981.9968 3009.2019 3014.8343 3033.7722 3044.3832 3108.6448 3139.9375 3515.1336 3535.0616 3537.2614
redmass: 8.8215 10.8202 13.3355 7.3936 8.2849 7.6653 3.7009 5.9229 5.1961 6.1844 13.9633 5.2238 7.4700 14.1081 7.1863 6.4227 3.3445 5.9633 1.4503 6.2601 2.1249 5.5004 3.7078 3.4969 3.4503 4.2544 4.5034 2.9050 2.9110 2.0752 1.5026 1.5989 4.0144 5.9453 5.5025 7.2787 3.8403 3.7154 3.1840 2.7201 2.6770 4.4610 1.2593 3.8672 5.4256 3.2779 3.2390 2.1919 2.0714 1.6358 2.1501 1.0671 1.6638 1.0826 1.1096 1.4010 1.5610 1.6465 1.4921 1.2749 1.9259 1.6846 1.4349 1.4700 1.5329 1.6351 1.1040 1.0851 1.6906 6.9785 9.0285 6.5643 1.0730 1.0652 1.0732 1.0845 1.0828 1.0952 1.0945 1.0845 1.0997 1.0641 1.0732 1.0693
irintensity: 0.1752 0.8714 0.3107 0.1422 3.1314 0.8292 0.2265 2.4734 2.0097 0.5160 0.8088 3.1844 2.1218 1.3137 2.9388 5.3251 27.0886 11.5718 120.1160 22.4696 1.9834 14.9901 11.9280 49.5679 43.4276 20.5357 46.0837 14.4336 5.2630 173.0836 61.1570 81.5525 87.1168 34.1596 57.3856 99.6093 13.1419 6.8930 1.1239 36.2532 7.1935 14.6842 2.3692 45.8166 26.9144 53.0503 41.4129 149.2148 15.2605 62.1222 21.2999 0.8205 99.9307 0.0904 30.6088 73.5666 25.7194 65.3576 40.4235 34.2361 18.2075 0.3961 3.4888 26.2495 11.3464 2.6282 37.1678 21.7294 315.5303 112.5301 205.3829 9.0544 10.7157 34.0124 29.9960 16.7567 16.8429 9.7919 9.6464 7.0787 47.5829 27.3386 21.6178 17.1935
temp: 298.150 k
press: 1.00000 atm
elementType: 17 17 17 8 8 8 8 7 6 6 6 6 6 6 6 6 6 6 1 1 1 1 1 1 1 1 1 1 1 1
symmnumber: 1
zpe: 560559.7 jmol-1
zpe.correction: 0.213506 hartree
zpe.thermalcorrener: 0.232592 hartree
zpe.thermalcorrenthalpy: 0.233536 hartree
zpe.thermalcorrgfe: 0.162986 hartree
zpe.sumelectzpe: -2122.703973 hartree
zpe.sumelectthermal: -2122.684888 hartree
zpe.sumelectthermalent: -2122.683943 hartree
zpe.sumelectthermalfe: -2122.754494 hartree
dipole: -0.4532 1.4075 -1.8907
dipole: 2.4003
quadrupole: -124.1491 -128.7956 -125.6562
quadrupole: 3.3304 -5.3952 -3.8752
quadrupole: 2.0512 -2.5953 0.5441 3.3304 -5.3952 -3.8752
hfenergy: -2122.9174792 hartree
pointgroup: C01 [X(C10H12Cl3N1O4)]
dipole: -0.3256662 -0.4906115 0.7382493 debye
polarizability: 178.3513669|-3.2111219|139.6058297|-1.8194019|-2.4016999|138.0824292 unknown
InChI: InChI=1S/C10H12Cl3NO4/c11-10(12,13)9(18)14-7(15)5-3-1-2-4-6(5)8(16)17/h1-2,5-6,9,14,16,18H,3-4H2
charge 0 multiplicity 1
30 atoms
Cl -4.939222 0.671808 -1.219839
Cl -2.2540 0.142496 -2.522558
Cl -3.417012 -1.878464 -0.577389
O  -0.168017 2.228785 0.178911
O  2.490189 -2.08476 1.681761
O  3.632524 -2.201119 -0.33108
O  -3.317599 0.570058 1.438573
N  -1.223972 0.179342 0.486941
C  1.208916 0.29064 0.896093
C  1.580513 -0.801445 -0.1688
C  2.369199 1.294459 1.09762
C  1.957799 -0.167063 -1.527222
C  -0.09023 1.009039 0.487535
C  3.099223 1.645511 -0.184801
C  2.913641 0.999389 -1.363027
C  2.687954 -1.729417 0.333262
C  -2.534539 0.699079 0.217437
C  -3.229925 -0.066448 -0.959793
H  1.009854 -0.226451 1.854517
H  0.705139 -1.468374 -0.319272
H  3.085853 0.877046 1.834305
H  1.963682 2.220939 1.546041
H  1.032418 0.169531 -2.038438
H  2.414951 -0.939161 -2.172796
H  3.811646 2.479058 -0.127858
H  3.464405 1.320297 -2.256253
H  -1.16902 -0.771171 0.861267
H  -2.416651 1.754567 -0.103179
H  3.199009 -2.728464 1.954134
H  -4.210826 0.984994 1.309906
