program: Gaussian 09
title: 000285362
version: EM64L-G09RevD.01
frameworkgroup: C1[X(C27H21Cl2NO5)]
method: RPBEPBE
basis: SDD
operation: Freq
keyword: #p
keyword: freq=noraman
keyword: PBEPBE/SDD
title: #p freq=noraman PBEPBE/SDD
converged: YES YES NO NO
title: Mulliken charges:
elementType: Cl Cl O O O O O N C C C C C C C C C C C C C C C C C C C C C C C C C C C H H H H H H H H H H H H H H H H H H H H H
charge: -0.066701 -0.064480 -0.384660 -0.256515 -0.233653 -0.414729 -0.194535 -0.221928 0.383455 -0.153506 0.257080 0.124214 -0.431496 -0.317204 0.447492 -0.323269 -0.234622 -0.240319 0.378935 0.387712 -0.436350 -0.370255 -0.336667 -0.299266 -0.381113 -0.362260 -0.223183 -0.194010 -0.238733 -0.208008 -0.223509 -0.192393 -0.186409 -0.121797 -0.117740 0.252305 0.223663 0.235396 0.287936 0.253565 0.236066 0.232667 0.234414 0.249917 0.285151 0.266220 0.267303 0.268579 0.232895 0.237676 0.415685 0.243581 0.254435 0.255856 0.259365 0.257745
chargesum: 0.00000
title: Mulliken charges with hydrogens summed into heavy atoms:
elementType: Cl Cl O O O O O N C C C C C C C C C C C C C C C C C C C C C C C C C C C
charge: -0.066701 -0.064480 -0.384660 -0.256515 -0.233653 0.000956 -0.194535 -0.221928 0.383455 0.098799 0.257080 0.124214 0.027562 -0.029268 0.447492 -0.069704 0.001444 -0.007652 0.378935 0.387712 -0.201937 -0.120337 -0.051516 -0.033046 -0.113810 -0.093681 0.009713 0.043666 0.004849 0.046427 0.032347 0.066972 0.071336 -0.121797 -0.117740
polarizability: 3.86100522e+02 -1.44190519e+01 4.24085262e+02 -1.88176957e+01 -2.84875996e+01 2.07210815e+02
1716.lowfreq: -4.8770 -3.0093 -1.4072 -0.0005 0.0012 0.0012 8.2410 16.4179 21.9591
frequency: 7.3373 16.3739 21.9375 23.4357 25.6438 36.2972 40.9650 48.7213 49.7670 59.6282 66.6423 85.6830 97.8400 103.0897 114.9165 132.6476 144.6211 158.0504 173.6739 188.4838 201.8040 226.8570 241.2292 265.6553 267.7196 302.2956 305.6659 316.3391 321.3824 340.0185 353.0963 372.6127 383.2059 402.5052 406.7048 414.1982 415.9325 436.9312 455.6727 461.5701 495.3644 500.1529 504.7842 521.7305 534.1966 546.9966 572.0657 592.8865 605.5710 615.8380 618.6187 622.1022 632.3107 653.7379 662.1637 685.4472 693.1277 696.3613 702.4016 716.8112 741.7801 749.3283 758.7948 789.9773 790.3791 804.2909 813.0178 824.4282 827.2825 840.4510 842.0836 854.7046 854.9661 883.5960 914.5630 922.6849 931.4437 932.3779 938.9397 944.7264 954.2634 956.5545 974.8945 980.9189 988.0127 990.2975 991.2741 993.2308 1003.2418 1011.6416 1026.8570 1028.6159 1047.2946 1069.8271 1073.3836 1091.2310 1101.8660 1106.5457 1111.6175 1162.2286 1172.5347 1176.2306 1177.3861 1181.2931 1187.1165 1189.7589 1190.3401 1202.1086 1223.6553 1226.1873 1274.3566 1285.4160 1286.1730 1295.3850 1321.7593 1326.6586 1334.2002 1353.3818 1366.6832 1374.2526 1384.1224 1388.7593 1400.4005 1404.4228 1436.9057 1442.9789 1461.6803 1466.5643 1475.5700 1479.6672 1486.2261 1500.5643 1581.3805 1587.6427 1591.0898 1596.1910 1597.3394 1599.0048 1603.8603 1613.2326 1616.4285 2976.6772 3042.2388 3047.4656 3121.5692 3132.1490 3141.5627 3142.4103 3146.8423 3154.8627 3158.0636 3159.3389 3159.9747 3160.2302 3163.9530 3171.3150 3173.7819 3175.9871 3177.5276 3180.5037 3183.4293 3196.9851
redmass: 8.0219 8.4283 10.7521 5.6627 6.0107 5.5374 4.0258 6.9956 4.9923 5.8624 5.1678 4.3460 7.0618 7.7864 9.3350 8.0871 7.0151 8.2731 6.7699 7.1879 7.4556 5.8109 9.1176 9.3043 6.9936 4.7552 4.5771 5.8997 5.4036 6.7737 4.9800 7.3566 6.3213 2.8232 9.2692 3.0101 3.1121 5.2080 3.4249 4.3628 3.2010 2.8313 5.5842 4.7393 6.2120 4.5347 6.5734 6.9115 4.1706 6.9389 6.0818 7.0943 7.2255 5.5020 1.3735 8.0468 3.7489 3.7449 1.9043 4.4891 3.0720 1.4416 2.0150 6.8402 5.1777 1.2964 1.3024 1.5496 1.5067 2.4040 1.9722 4.1968 1.2812 7.1555 4.1864 1.5802 1.3882 1.3368 1.3682 5.0531 1.3440 1.3467 1.3276 1.3969 1.9566 3.8928 4.0910 4.0768 1.3473 6.3574 2.1881 6.8353 2.2225 2.5358 2.5297 1.5229 2.4723 1.3018 1.3440 1.7481 1.6581 1.0590 1.2154 1.2664 1.3786 1.1275 1.4290 2.4124 4.1337 2.5883 1.9575 1.2753 1.4763 1.2684 1.4076 1.3411 1.4578 1.5852 6.0091 6.0248 9.3203 6.4881 3.7913 3.5493 2.2432 2.1670 1.7583 2.2485 2.3481 1.1622 2.3137 2.0507 7.2487 7.1162 6.8651 6.1170 6.8710 7.0426 6.7750 10.2402 6.1285 1.0563 1.1079 1.0841 1.0881 1.0874 1.0914 1.0855 1.0682 1.0959 1.0883 1.0886 1.0889 1.0914 1.0887 1.1013 1.0975 1.0966 1.0965 1.0976 1.0978 1.0961
irintensity: 0.0937 0.5207 0.0117 0.1782 0.2920 0.0909 0.0202 0.6979 0.5227 0.7947 0.2762 2.5233 0.6601 0.8643 0.1238 0.9239 6.2064 0.4980 7.1210 1.5741 1.5052 0.0989 0.3425 9.9995 0.2351 0.7668 2.0642 0.2312 1.4533 1.6953 8.2921 6.4525 13.9082 0.0501 24.5456 0.1731 1.0404 7.6174 5.9125 9.0672 28.5281 17.5897 17.5254 8.0072 9.2350 2.0055 12.0723 1.9815 9.0648 7.0453 7.7378 5.7842 21.5900 10.8322 230.3574 31.3404 3.9424 0.2289 75.8381 0.7509 30.7581 67.8317 99.0218 38.4242 8.8897 9.9788 8.3945 40.4053 65.4732 16.2645 8.9320 52.5722 6.7839 289.9409 66.8876 18.6975 7.9250 1.4784 4.2699 102.2829 0.1678 0.7307 0.2278 0.6348 2.5396 30.8854 4.7145 39.6699 0.1407 30.7903 3.7924 189.6263 25.0983 35.4471 30.0870 6.6775 81.3270 11.5369 13.7375 148.3397 62.6069 0.1711 24.9285 59.1321 7.9766 4.4861 89.9497 177.6182 200.6973 35.0969 124.4846 2.3835 12.5229 0.8908 26.0844 75.5347 59.6774 71.9137 9.5563 0.9279 3.1671 3.3793 1.1625 0.0146 66.7574 5.6325 54.1189 227.3022 253.0570 13.8464 3.7953 43.9158 15.2539 12.0061 63.5726 0.3239 9.5325 54.6308 11.1447 108.3070 0.3169 38.8066 17.3263 12.2908 6.8451 4.2960 6.3740 18.9555 303.5940 27.0117 2.0116 3.5595 1.7813 19.9565 2.0921 11.7162 14.4565 1.0502 1.9001 0.3122 1.7943 1.4281
temp: 298.150 k
press: 1.00000 atm
elementType: 17 17 8 8 8 8 8 7 6 6 6 6 6 6 6 6 6 6 6 6 6 6 6 6 6 6 6 6 6 6 6 6 6 6 6 1 1 1 1 1 1 1 1 1 1 1 1 1 1 1 1 1 1 1 1 1
symmnumber: 1
zpe: 1083273.6 jmol-1
zpe.correction: 0.412597 hartree
zpe.thermalcorrener: 0.444110 hartree
zpe.thermalcorrenthalpy: 0.445054 hartree
zpe.thermalcorrgfe: 0.343785 hartree
zpe.sumelectzpe: -2389.917442 hartree
zpe.sumelectthermal: -2389.885929 hartree
zpe.sumelectthermalent: -2389.884984 hartree
zpe.sumelectthermalfe: -2389.986254 hartree
dipole: 7.5176 1.0222 -1.6265
dipole: 7.7592
quadrupole: -203.6932 -214.0805 -216.0704
quadrupole: -3.4114 -7.0483 4.5185
quadrupole: 7.5882 -2.7992 -4.7891 -3.4114 -7.0483 4.5185
hfenergy: -2390.3300387 hartree
pointgroup: C01 [X(C27H21Cl2N1O5)]
dipole: 2.6054537 0.6968874 -1.4300214 debye
polarizability: 345.375479|82.6340242|285.6424603|-20.1083829|70.6243485|386.3786596 unknown
InChI: InChI=1S/C27H21Cl2NO5/c28-20-10-14-22(15-11-20)34-27(35-23-16-12-21(29)13-17-23)26(31)30(32)24-8-4-5-9-25(24)33-18-19-6-2-1-3-7-19/h1-17,27,32H,18H2
charge 0 multiplicity 1
56 atoms
Cl -1.768145 -2.626062 -4.755472
Cl -5.923705 -4.67681 3.437956
O  2.933026 1.439439 -0.43706
O  -1.474259 0.335625 0.49403
O  -1.938525 -0.198212 2.768166
O  1.619404 -0.345699 0.85948
O  -0.215113 1.822699 3.081578
N  1.352007 0.833807 1.677543
C  2.452655 1.720365 1.895919
C  -0.912177 -0.162949 1.766751
C  3.294631 2.044652 0.789099
C  0.086837 0.922679 2.25553
C  3.658623 1.825678 -1.680841
C  2.717991 2.297238 3.158195
C  3.031474 1.065594 -2.825286
C  4.392932 2.912869 0.951474
C  3.805872 3.183556 3.316045
C  4.642681 3.485817 2.219991
C  -1.493309 -0.447032 -0.680056
C  -2.837762 -1.286768 2.825425
C  3.790465 0.123874 -3.56264
C  1.671344 1.282957 -3.16713
C  -0.641368 -1.547554 -0.945602
C  -2.937649 -2.320767 1.865632
C  -2.432274 -0.01688 -1.649828
C  -3.682875 -1.273523 3.96044
C  3.20179 -0.588798 -4.632682
C  1.080038 0.56161 -4.225608
C  1.844175 -0.374691 -4.962385
C  -0.740636 -2.220032 -2.185786
C  -3.880236 -3.35783 2.058763
C  -2.524064 -0.681567 -2.889136
C  -4.624655 -2.303109 4.150346
C  -1.673596 -1.777809 -3.139429
C  -4.707073 -3.337506 3.195156
H  -0.442447 -1.152382 1.629421
H  4.729705 1.571278 -1.567973
H  3.552284 2.922477 -1.794442
H  2.056529 2.068296 3.9958
H  5.042695 3.15774 0.106852
H  3.997396 3.631655 4.295833
H  5.489742 4.168446 2.34371
H  4.840367 -0.055218 -3.299767
H  1.075017 2.002501 -2.593972
H  0.124049 -1.858219 -0.230444
H  -2.323627 -2.333331 0.961418
H  -3.082085 0.830872 -1.414795
H  -3.585951 -0.454966 4.678991
H  3.797226 -1.313031 -5.199153
H  0.025343 0.720999 -4.472812
H  2.007056 0.063727 0.013833
H  1.380587 -0.935284 -5.781186
H  -0.078578 -3.062327 -2.405739
H  -3.968626 -4.161212 1.321942
H  -3.25032 -0.356529 -3.639686
H  -5.280081 -2.300954 5.025585
