program: Gaussian 09
title: 000284983
version: EM64L-G09RevD.01
frameworkgroup: C1[X(C12H12BrNO7)]
method: RPBEPBE
basis: SDD
operation: Freq
keyword: #p
keyword: freq=noraman
keyword: PBEPBE/SDD
title: #p freq=noraman PBEPBE/SDD
converged: YES YES NO NO
title: Mulliken charges:
elementType: Br O O O O O O O N C C C C C C C C C C C C H H H H H H H H H H H H
charge: 0.068220 -0.247540 -0.284358 -0.277982 -0.195123 -0.194091 -0.221194 -0.208373 0.020064 0.325490 -0.081494 0.249140 -0.271327 -0.494731 0.513655 -0.466888 0.338067 0.302595 -0.514990 -0.758309 -0.750215 0.311269 0.290450 0.308744 0.262820 0.248211 0.252087 0.265359 0.247603 0.249522 0.237104 0.228560 0.247654
chargesum: 0.00000
title: Mulliken charges with hydrogens summed into heavy atoms:
elementType: Br O O O O O O O N C C C C C C C C C C C C
charge: 0.068220 -0.247540 -0.284358 -0.277982 -0.195123 -0.194091 -0.221194 -0.208373 0.020064 0.325490 0.229775 0.249140 0.019123 -0.185986 0.513655 -0.466888 0.338067 0.302595 0.198327 0.004808 0.012269
polarizability: 2.50364820e+02 1.43829897e+01 2.06096462e+02 -7.52791304e+00 -6.48291651e+00 1.15962719e+02
1716.lowfreq: -18.5840 -2.7771 -0.0003 0.0007 0.0009 4.1487 9.1795 18.1558 28.0099
frequency: -15.0299 17.8769 27.9332 46.8956 50.8198 58.1422 60.8779 63.8566 84.6709 87.5226 90.9238 124.2413 133.7723 145.5742 172.9821 194.3073 209.1399 220.4880 231.9754 244.6057 273.5485 284.0702 339.3637 367.1568 393.3644 446.6021 460.1560 489.0696 493.2561 539.2760 551.4984 572.0613 587.9998 602.9974 630.1541 644.4327 674.8767 717.1356 733.2437 739.8196 803.7049 829.7436 874.0819 893.7260 907.9920 929.1326 938.5363 964.7830 985.5992 986.6128 1005.7207 1041.2504 1042.5326 1069.8235 1105.9721 1148.0600 1162.6010 1171.9970 1186.7540 1205.1494 1234.1825 1239.5549 1302.5125 1320.0862 1334.2263 1374.3020 1384.1257 1384.9682 1393.5324 1430.5720 1451.0509 1452.2565 1452.6505 1453.3005 1460.3985 1467.3538 1470.8637 1543.7838 1602.9500 1673.0393 1686.4024 2972.7896 3007.2980 3008.2990 3061.4966 3068.6640 3098.9865 3099.2306 3135.5858 3143.5616 3144.6762 3184.1865 3187.3879
redmass: 3.1433 6.5505 7.0764 5.4157 5.7350 5.1734 3.9991 1.7516 1.2419 2.4682 2.7137 4.4498 4.7926 1.3500 6.5237 9.1329 6.6460 8.9569 5.4128 8.5440 6.6434 4.9089 5.4394 7.6889 6.8984 4.6444 3.8661 4.6748 7.5923 6.2300 3.5065 3.4925 5.6026 5.7632 6.9655 5.8740 7.9688 9.8384 3.6622 9.2155 6.0644 6.6565 5.0822 2.9263 6.1453 1.7999 1.9217 4.5078 2.0614 6.1865 2.6113 1.6752 1.6720 2.7211 1.2344 1.3675 2.5190 2.5415 3.3094 9.5945 5.0397 1.2944 1.2236 1.7791 4.9031 4.9120 1.2705 1.2985 6.2255 1.3416 1.0543 1.0573 1.0518 1.0489 1.0588 1.0682 2.6759 9.1668 8.1483 10.1154 10.2938 1.0315 1.0380 1.0375 1.0835 1.1050 1.0950 1.0958 1.1015 1.1020 1.1016 1.0916 1.0918
irintensity: 5.1618 0.0220 0.7869 2.9636 2.2562 0.4821 1.3860 3.0862 0.3676 0.2111 1.5190 1.6349 0.3193 0.0055 1.6612 7.5626 1.9230 2.7558 8.5376 1.7358 1.1084 6.0117 7.3688 0.8937 0.6983 16.0595 5.7155 18.3081 20.6716 7.8493 7.0412 11.5721 12.4716 4.4958 6.0014 9.4668 7.2739 2.7654 0.4556 27.1898 6.7129 42.8198 90.1553 9.7990 371.3083 86.7586 22.8395 19.4281 29.7976 131.1608 143.2481 7.6180 8.6783 6.7327 1.5322 6.4520 110.3020 120.9135 450.7897 381.0250 145.4424 11.9114 25.5579 14.7067 11.3873 53.5760 59.3456 59.4966 83.7780 16.1657 21.5831 28.0855 7.5504 24.5980 19.7833 26.5764 121.8341 50.4754 25.4176 109.2375 246.3464 58.2862 0.6423 0.6698 20.6075 28.1126 4.9863 4.7827 19.9030 8.4071 9.2628 8.9809 2.5919
temp: 298.150 k
press: 1.00000 atm
elementType: 35 8 8 8 8 8 8 8 7 6 6 6 6 6 6 6 6 6 6 6 6 1 1 1 1 1 1 1 1 1 1 1 1
symmnumber: 1
zpe: 599835.9 jmol-1
zpe.correction: 0.228465 hartree
zpe.thermalcorrener: 0.250168 hartree
zpe.thermalcorrenthalpy: 0.251112 hartree
zpe.thermalcorrgfe: 0.173794 hartree
zpe.sumelectzpe: -1057.596672 hartree
zpe.sumelectthermal: -1057.574970 hartree
zpe.sumelectthermalent: -1057.574026 hartree
zpe.sumelectthermalfe: -1057.651344 hartree
dipole: -3.1886 -2.6256 1.5407
dipole: 4.4085
quadrupole: -124.0173 -128.7034 -133.3768
quadrupole: -6.6665 23.7322 -0.8223
quadrupole: 4.6819 -0.0042 -4.6777 -6.6665 23.7322 -0.8223
hfenergy: -1057.8251378 hartree
pointgroup: C01 [X(C12H12Br1N1O7)]
dipole: 1.0243177 1.190708 0.7357049 debye
polarizability: 242.1371992|18.5959861|210.6250478|22.8306249|9.2308602|119.661754 unknown
InChI: InChI=1S/C12H12BrNO7/c1-6(15)20-12(21-7(2)16)8-4-9(13)11(19-3)5-10(8)14(17)18/h4-5,12H,1-3H3
charge 0 multiplicity 1
33 atoms
Br 3.578978 2.483445 1.183372
O  -1.942328 -0.298898 0.8824
O  -1.506144 1.817194 -0.060564
O  4.395794 -0.577339 0.861448
O  0.604813 -3.548419 -0.252754
O  -1.091616 -2.229734 -0.998447
O  -3.912664 -0.016511 -0.344222
O  -1.87922 1.98287 -2.370723
N  0.069605 -2.392106 -0.45727
C  0.260921 0.105015 0.030281
C  -1.216214 0.383428 -0.197518
C  0.849575 -1.188015 -0.067192
C  1.107453 1.171371 0.404315
C  2.220123 -1.399359 0.188189
C  3.057415 -0.322731 0.541144
C  2.479948 0.970939 0.647637
C  -3.33271 -0.488137 0.651299
C  -1.964263 2.485328 -1.237081
C  5.36959 -0.371523 -0.237415
C  -3.927119 -1.319299 1.759741
C  -2.533354 3.831098 -0.867837
H  -1.580022 0.040792 -1.181531
H  0.669213 2.165539 0.513253
H  2.633511 -2.409198 0.126548
H  -3.601806 -2.368704 1.641479
H  -5.024565 -1.275157 1.711492
H  -3.569464 -0.969873 2.742014
H  -3.555833 3.687765 -0.472964
H  -1.935711 4.310419 -0.075872
H  -2.583836 4.474007 -1.758565
H  5.361041 0.678865 -0.581714
H  5.146196 -1.051287 -1.08143
H  6.34909 -0.616885 0.197184
