program: Gaussian 09
title: 000285004
version: EM64L-G09RevD.01
frameworkgroup: C1[X(C21H18N2O3)]
method: RPBEPBE
basis: SDD
operation: Freq
keyword: #p
keyword: freq=noraman
keyword: PBEPBE/SDD
title: #p freq=noraman PBEPBE/SDD
converged: YES YES NO NO
title: Mulliken charges:
elementType: O O O N N C C C C C C C C C C C C C C C C C C C C C H H H H H H H H H H H H H H H H H H
charge: -0.261059 -0.198554 -0.262349 -0.229223 0.067696 -0.504953 0.425759 -0.346654 0.179651 -0.455384 0.274011 0.445069 -0.495700 -0.062892 -0.314762 -0.405019 -0.306657 -0.240145 -0.224163 -0.441903 0.409433 -0.404485 -0.367847 -0.236569 -0.214805 -0.251670 0.284559 0.271673 0.259909 0.301739 0.240924 0.219570 0.215336 0.239728 0.274625 0.235055 0.238364 0.238573 0.214688 0.234177 0.265195 0.225901 0.234336 0.228822
chargesum: 0.00000
title: Mulliken charges with hydrogens summed into heavy atoms:
elementType: O O O N N C C C C C C C C C C C C C C C C C C C C C
charge: -0.261059 -0.198554 -0.262349 -0.229223 0.067696 0.051279 0.425759 -0.346654 0.179651 -0.195474 0.274011 0.445069 0.046963 -0.062892 0.120144 -0.165291 -0.032031 -0.005090 0.014200 0.011358 0.409433 -0.170309 -0.102652 -0.010668 0.019532 -0.022848
polarizability: 3.64279142e+02 -5.20579555e+01 1.64668580e+02 2.43958141e+01 2.81842997e+01 2.16439317e+02
1716.lowfreq: -6.4662 -0.0004 -0.0002 0.0005 2.8781 10.4427 18.6899 20.3105 37.9345
frequency: 18.0801 19.7383 37.8835 52.8245 56.8365 72.4705 94.1184 107.4853 118.7500 141.7544 169.6203 212.5975 224.8586 231.3856 257.5495 267.3410 277.9227 289.3226 339.5869 356.3981 365.2963 403.2249 404.1339 405.6640 452.8065 462.1389 480.6532 490.7127 517.4285 540.4574 560.4969 581.5307 593.0548 615.0473 631.2864 633.3316 667.4187 687.5640 703.4827 735.4315 735.7451 757.8248 770.2389 780.6915 785.6838 796.1918 807.9781 859.2330 861.1661 881.3013 905.0714 915.9280 916.3912 930.8526 973.9921 975.9694 982.8652 988.2801 992.7088 1000.4459 1002.2455 1002.4095 1017.1706 1024.7190 1034.1848 1052.7627 1076.4095 1083.1388 1097.2669 1135.3033 1139.1535 1169.8847 1170.1181 1176.8972 1182.5309 1193.1672 1196.3280 1201.9982 1237.6337 1242.2043 1245.6927 1257.6538 1283.9993 1306.6203 1309.6325 1329.6981 1349.1309 1363.6867 1369.6266 1379.0911 1387.7820 1399.8332 1418.9303 1426.9322 1437.0834 1444.5944 1456.1525 1458.1242 1459.6655 1481.5732 1505.6577 1560.6799 1585.9320 1590.9599 1611.6728 1621.3751 1621.6047 1660.4656 2964.2675 2980.8880 2991.0160 3007.6706 3028.0605 3057.8158 3079.2664 3093.4727 3112.6707 3124.5035 3127.1830 3131.3913 3137.5054 3142.4334 3150.1550 3158.9965 3164.3364 3174.4563
redmass: 5.9652 5.1731 4.8221 4.3749 5.9744 5.1357 5.9515 6.4092 4.3776 4.8003 4.2526 4.6116 4.2816 4.3751 3.3354 4.4240 4.8648 3.5076 4.8486 2.9776 3.7868 4.1255 3.6138 3.8723 3.8121 3.1385 2.9025 3.4092 3.8716 7.7631 3.4897 5.2342 7.0410 6.4170 6.2838 5.0867 6.0508 4.1341 2.5081 1.5073 5.6564 2.1503 5.1541 1.9230 3.2402 4.0556 3.5314 4.9345 1.2533 1.5079 3.6662 1.5748 1.5794 3.0865 1.3918 2.4482 1.3980 6.1194 2.2597 1.6561 1.4623 1.4642 2.1855 2.2402 2.1886 3.8636 2.5207 1.8912 3.1344 4.8012 1.9138 1.2250 1.0607 1.1034 1.1276 1.2980 1.4559 2.5476 2.5762 2.4177 1.2843 2.9003 1.1641 1.3646 1.9870 2.2262 1.4410 1.9230 1.2643 3.2750 3.5311 4.1704 3.4656 1.1356 1.8328 1.1694 1.0965 1.1493 2.9503 2.2193 4.1346 8.6698 7.7933 6.0690 6.0036 7.5691 6.7026 11.9245 1.0582 1.0672 1.0660 1.0593 1.1039 1.1034 1.1005 1.0901 1.0859 1.0878 1.0878 1.0931 1.0922 1.0894 1.0950 1.0948 1.1005 1.0995
irintensity: 0.0304 1.4646 1.0743 0.6308 0.1951 0.2100 0.1466 4.2934 2.5490 12.9811 6.4801 1.8483 3.9107 2.7962 2.1929 3.4824 5.3846 0.6217 2.3033 4.0263 7.1181 1.7207 0.0927 0.7679 10.3714 14.0206 9.1607 14.4460 1.4912 4.0174 6.5214 16.5461 12.8491 0.2482 2.7745 6.9783 0.1850 6.7041 27.3715 80.0090 10.8439 17.5972 13.6468 66.1957 13.2255 7.7798 0.0547 17.6472 2.9806 10.2870 11.2221 8.0944 8.5728 8.9272 3.2577 24.3269 1.5038 1.0877 16.1802 4.4595 15.6500 0.3362 10.4400 7.6175 3.8410 83.7898 14.6739 14.4062 3.7485 119.4714 3.5437 4.2284 0.3566 0.4637 1.0878 38.7484 25.8643 2.4691 231.8683 15.9997 53.0756 2.5772 30.1850 4.3976 78.0297 34.6435 11.8516 253.3857 8.2638 33.5300 4.6248 0.2600 5.1073 35.2880 9.1832 10.9284 59.1624 6.2189 5.0290 9.2574 19.0468 3.0822 127.7605 1.6914 4.9497 7.9294 18.6176 235.2135 36.6108 9.4884 58.2199 8.2462 20.5042 2.1851 24.8258 2.5537 3.7048 2.3475 3.1887 7.3151 17.5591 10.9547 19.5566 20.0854 12.4236 21.4268
temp: 298.150 k
press: 1.00000 atm
elementType: 8 8 8 7 7 6 6 6 6 6 6 6 6 6 6 6 6 6 6 6 6 6 6 6 6 6 1 1 1 1 1 1 1 1 1 1 1 1 1 1 1 1 1 1
symmnumber: 1
zpe: 898884.2 jmol-1
zpe.correction: 0.342367 hartree
zpe.thermalcorrener: 0.363818 hartree
zpe.thermalcorrenthalpy: 0.364762 hartree
zpe.thermalcorrgfe: 0.289974 hartree
zpe.sumelectzpe: -1144.402134 hartree
zpe.sumelectthermal: -1144.380682 hartree
zpe.sumelectthermalent: -1144.379738 hartree
zpe.sumelectthermalfe: -1144.454526 hartree
dipole: -4.5371 1.9377 3.7001
dipole: 6.1669
quadrupole: -132.9759 -150.7517 -150.2352
quadrupole: -8.1697 -2.1197 0.9096
quadrupole: 11.6783 -6.0974 -5.5809 -8.1697 -2.1197 0.9096
hfenergy: -1144.7445006 hartree
pointgroup: C01 [X(C21H18N2O3)]
dipole: 1.4072962 -1.543758 1.2341053 debye
polarizability: 289.0711956|-105.4325008|237.399202|-48.2500822|-7.9654454|218.9166419 unknown
InChI: InChI=1S/C21H18N2O3/c24-19(10-11-26-14-15-6-2-1-3-7-15)23-13-17-12-16-8-4-5-9-18(16)22-20(17)21(23)25/h1-9,12H,10-11,13-14H2
charge 0 multiplicity 1
44 atoms
O  -4.61187 2.384013 -0.262199
O  0.056941 2.129044 -1.485308
O  -2.076244 1.927937 2.274469
N  -0.453946 1.363925 0.738524
N  2.273291 0.053906 -1.261294
C  0.086379 0.370498 1.712122
C  1.252657 -0.234243 0.970681
C  1.358555 0.35818 -0.328967
C  0.279433 1.388303 -0.499989
C  2.163129 -1.216466 1.341007
C  -1.605702 2.097837 1.111089
C  3.172909 -1.592041 0.391566
C  -2.205054 3.077268 0.110191
C  3.190128 -0.928052 -0.906613
C  -3.701535 3.357012 0.362881
C  4.160754 -2.591169 0.668725
C  4.188806 -1.291867 -1.866518
C  5.122425 -2.923748 -0.288081
C  5.136769 -2.270789 -1.563489
C  -4.775237 1.109264 0.45148
C  -3.812039 0.013298 -0.000219
C  -3.483617 -1.048314 0.880617
C  -3.280083 0.005179 -1.313448
C  -2.64226 -2.102558 0.456112
C  -2.42473 -1.038301 -1.734575
C  -2.105236 -2.098224 -0.853403
H  -0.700558 -0.365131 1.957471
H  0.372806 0.877908 2.650758
H  2.128474 -1.703206 2.322678
H  -2.035556 2.745692 -0.925726
H  -1.640587 4.028406 0.20946
H  -3.974178 4.312059 -0.116678
H  -3.900449 3.422257 1.45142
H  4.15215 -3.092421 1.644096
H  4.173749 -0.77404 -2.830193
H  5.874019 -3.689187 -0.066565
H  5.89878 -2.544725 -2.300846
H  -5.813906 0.80255 0.222151
H  -4.691265 1.26499 1.546803
H  -3.882329 -1.045854 1.903016
H  -3.534628 0.82681 -1.99141
H  -2.405814 -2.923089 1.144073
H  -2.008462 -1.023164 -2.748068
H  -1.447067 -2.910048 -1.183201
