program: Gaussian 09
title: 000284944
version: EM64L-G09RevD.01
frameworkgroup: C1[X(C17H12FNO2)]
method: RPBEPBE
basis: SDD
operation: Freq
keyword: #p
keyword: freq=noraman
keyword: PBEPBE/SDD
title: #p freq=noraman PBEPBE/SDD
converged: YES YES NO NO
title: Mulliken charges:
elementType: F O O N C C C C C C C C C C C C C C C C C H H H H H H H H H H H H
charge: -0.202537 -0.443037 -0.255092 -0.042620 0.294535 -0.132924 0.172666 0.037144 -0.567867 -0.372621 0.456184 -0.327720 0.369468 -0.346044 -0.815850 -0.347498 -0.339805 0.114904 -0.394526 -0.375361 0.326191 0.303017 0.268679 0.264307 0.239011 0.237185 0.232142 0.231911 0.226585 0.287946 0.255973 0.256372 0.389282
chargesum: 0.00000
title: Mulliken charges with hydrogens summed into heavy atoms:
elementType: F O O N C C C C C C C C C C C C C C C C C
charge: -0.202537 -0.053755 -0.255092 -0.042620 0.294535 -0.132924 0.172666 0.037144 -0.264850 -0.103942 0.456184 -0.063413 0.369468 -0.107033 -0.114612 -0.120913 -0.051858 0.114904 -0.138553 -0.118988 0.326191
polarizability: 3.73412754e+02 -2.46507659e+01 2.25955144e+02 4.27090963e-02 3.65835571e-01 7.98046324e+01
1716.lowfreq: -6.0512 -2.5694 -2.0159 -0.0010 -0.0004 0.0003 12.1070 37.1254 44.0943
frequency: 11.9296 37.1224 44.0821 79.1075 82.7444 83.3900 129.9158 162.5811 176.7512 197.1504 231.4831 253.5304 297.9972 316.3254 361.4518 384.4514 385.1779 406.2636 413.1418 416.6022 478.0445 499.5270 508.1109 529.3675 565.6435 569.8381 587.7338 606.5946 623.7292 630.3671 679.7999 707.1628 727.4095 749.7917 770.8427 796.9404 810.4583 816.1068 839.8491 850.2348 851.6169 902.1872 929.6413 930.5985 949.6335 964.3686 986.0587 992.9375 1002.7780 1009.8626 1050.5744 1061.5931 1067.1309 1107.7814 1142.2447 1156.6704 1171.9835 1203.1881 1230.4435 1260.8580 1282.2437 1290.0632 1300.6130 1324.1445 1345.2506 1369.7298 1378.0356 1397.5244 1400.1069 1417.0120 1457.1461 1468.5530 1476.2546 1494.4960 1508.5634 1536.9164 1574.5247 1596.2831 1611.1807 1627.5538 1636.6874 2976.2573 3051.9312 3093.0196 3126.6274 3151.6550 3162.9742 3166.5060 3176.2835 3177.4348 3181.8435 3201.0759 3531.0123
redmass: 3.8143 7.0636 8.4763 1.0905 4.9848 5.9058 5.5731 5.5735 4.1363 5.1440 5.9261 7.0541 5.7352 5.7612 7.8872 5.3505 5.0566 3.1821 3.2168 4.5612 6.9787 2.7789 3.3843 5.7465 2.2870 7.2985 5.1824 1.5646 5.6814 7.1990 3.4584 5.7905 3.9698 5.3473 6.2806 3.0262 5.9887 1.3321 1.5601 1.5717 8.5429 4.9031 1.5023 1.5115 1.3639 3.7037 1.3408 1.3482 2.9070 1.6033 1.5742 2.9735 2.6000 1.3147 1.3683 1.4478 1.8505 2.1122 2.1518 1.9936 2.0249 2.1675 1.4898 5.1557 3.3051 3.8838 4.7757 1.5349 3.5638 3.7461 1.7211 1.0459 2.0107 2.8994 2.9370 6.9826 6.8795 7.5794 6.4016 6.1683 8.6359 1.0379 1.0971 1.0985 1.0893 1.0886 1.0886 1.0957 1.0923 1.0962 1.0973 1.0905 1.0642
irintensity: 0.0000 0.0417 1.7000 0.7717 0.3111 0.2427 1.1863 1.7833 0.8355 1.8127 1.0313 1.0775 1.2636 1.6988 0.2354 0.9725 2.7966 4.5774 3.6046 4.8419 9.4501 11.7180 1.1621 10.7668 75.0529 26.8569 46.2936 83.5149 18.2490 1.0495 3.5204 1.6991 3.3151 25.0040 13.9381 2.4698 4.0153 9.2932 26.6076 89.5326 11.3729 4.9978 0.4601 18.8480 0.5967 74.2302 2.2678 0.8120 15.5708 4.1774 14.7779 151.2330 173.8929 15.7415 30.7449 102.5661 17.8749 19.6311 0.0941 31.1989 13.2577 22.5272 5.9628 33.7782 80.3560 20.9545 24.7636 2.4304 24.3521 4.4013 21.0372 14.4307 1.8486 127.0493 25.4010 93.6104 95.8705 5.2151 27.5877 18.5378 204.3209 33.1778 18.2423 14.6644 17.6005 9.7942 0.7363 8.3261 11.4765 4.7827 8.4404 0.4407 56.4342
temp: 298.150 k
press: 1.00000 atm
elementType: 9 8 8 7 6 6 6 6 6 6 6 6 6 6 6 6 6 6 6 6 6 1 1 1 1 1 1 1 1 1 1 1 1
symmnumber: 1
zpe: 641679.3 jmol-1
zpe.correction: 0.244403 hartree
zpe.thermalcorrener: 0.261885 hartree
zpe.thermalcorrenthalpy: 0.262829 hartree
zpe.thermalcorrgfe: 0.196760 hartree
zpe.sumelectzpe: -958.639694 hartree
zpe.sumelectthermal: -958.622212 hartree
zpe.sumelectthermalent: -958.621267 hartree
zpe.sumelectthermalfe: -958.687336 hartree
dipole: 2.3963 0.5765 0.0015
dipole: 2.4647
quadrupole: -127.0623 -100.7073 -124.6998
quadrupole: -10.5052 0.0111 0.1285
quadrupole: -9.5725 16.7825 -7.2100 -10.5052 0.0111 0.1285
hfenergy: -958.8840967 hartree
pointgroup: C01 [X(C17H12F1N1O2)]
dipole: 0.9444729 0.2079105 -0.0709631 debye
polarizability: 372.8473352|-26.6435658|218.653572|-0.0182261|-32.7611783|87.6716227 unknown
InChI: InChI=1S/C17H12FNO2/c1-10-2-7-15-13(8-10)14(17(20)21)9-16(19-15)11-3-5-12(18)6-4-11/h2-9,20H,1H3
charge 0 multiplicity 1
33 atoms
F  -6.448045 -0.340159 0.23724
O  1.121201 3.567865 -0.8884
O  3.272068 2.739796 -0.733842
N  -0.079405 -1.149439 0.294119
C  2.099732 0.027322 -0.041752
C  1.300475 -1.149068 0.263204
C  1.356596 1.238467 -0.322332
C  -0.749781 0.000493 0.028051
C  3.526464 -0.093295 -0.043288
C  -0.044633 1.208822 -0.284094
C  4.156834 -1.313436 0.240667
C  1.962775 -2.387074 0.55094
C  -2.239962 -0.056614 0.075923
C  3.352285 -2.466435 0.53956
C  5.66842 -1.434838 0.237569
C  -3.055465 1.083936 -0.163758
C  -2.876264 -1.294893 0.372268
C  2.037342 2.525505 -0.653474
C  -4.462241 0.998202 -0.111805
C  -4.278527 -1.401084 0.428529
C  -5.043161 -0.246238 0.183643
H  4.125672 0.790931 -0.272008
H  -0.583957 2.131365 -0.499681
H  1.332565 -3.252543 0.776153
H  3.848802 -3.418976 0.761041
H  6.15253 -0.476336 -0.012063
H  6.044425 -1.759156 1.226603
H  6.006313 -2.189423 -0.498023
H  -2.608766 2.055899 -0.392562
H  -2.24021 -2.164867 0.555901
H  -5.097053 1.869792 -0.294352
H  -4.77492 -2.349002 0.655055
H  1.63539 4.392083 -1.102033
