program: Gaussian 09
title: 000284932
version: EM64L-G09RevD.01
frameworkgroup: C1[X(C9H17N3O3)]
method: RPBEPBE
basis: SDD
operation: Freq
keyword: #p
keyword: freq=noraman
keyword: PBEPBE/SDD
title: #p freq=noraman PBEPBE/SDD
converged: NO YES NO NO
title: Mulliken charges:
elementType: O O O N N N C C C C C C C C C H H H H H H H H H H H H H H H H H
charge: -0.242381 -0.282179 -0.287607 -0.164081 -0.413688 -0.373958 -0.349479 -0.348376 -0.313281 -0.312821 -0.439106 0.193216 0.249926 -0.332496 -0.646356 0.227726 0.212816 0.206607 0.218069 0.224049 0.199830 0.197990 0.221470 0.248183 0.239530 0.377586 0.215580 0.251313 0.362547 0.233041 0.211461 0.214869
chargesum: 0.00000
title: Mulliken charges with hydrogens summed into heavy atoms:
elementType: O O O N N N C C C C C C C C C
charge: -0.242381 -0.282179 -0.287607 -0.164081 -0.036102 -0.011411 0.091062 0.076300 0.110598 0.106639 0.048607 0.193216 0.249926 0.134397 0.013014
polarizability: 1.59286829e+02 1.81592548e+00 1.23237703e+02 -5.84650444e+00 4.75693855e+00 1.01810855e+02
1716.lowfreq: -10.6927 -0.0012 -0.0010 -0.0003 6.4255 11.4902 22.4915 32.7183 48.3848
frequency: 21.7190 32.0942 48.3627 59.4177 77.4085 113.9246 137.1886 170.4285 189.1123 229.0375 244.5084 289.5276 312.6039 323.3978 340.5049 386.9919 403.7195 442.4701 468.2982 498.8835 534.6619 571.1016 620.1522 704.2504 714.0982 768.2810 786.2903 799.9687 810.2597 839.7614 865.2338 880.6110 899.1997 939.7616 976.4130 983.4729 1004.0696 1025.4307 1052.4997 1081.7096 1083.3129 1104.5850 1131.2516 1132.9749 1140.1073 1156.6327 1178.9830 1192.1932 1216.8473 1230.8818 1268.1518 1278.7198 1293.9524 1294.7153 1314.6936 1337.8161 1353.3229 1356.0602 1371.8460 1373.4672 1387.1290 1434.3653 1446.3073 1446.8603 1454.4700 1457.2264 1465.4014 1467.9396 1470.8294 1482.1036 1537.9020 1610.6666 1668.4372 2901.6518 2906.7005 2946.5746 2956.4255 2959.7748 2983.7130 3001.1923 3031.2492 3035.4434 3037.7424 3069.3144 3085.0640 3087.3012 3090.6197 3098.3740 3345.0141 3367.6265
redmass: 2.9805 3.2120 4.8706 4.5077 3.8133 6.8488 3.4955 3.1855 3.6769 1.5018 1.8346 3.0523 2.8211 2.6626 4.1121 3.7984 2.3684 3.9139 2.7988 5.1362 3.8724 3.6075 2.0893 3.6320 7.0533 1.8978 2.4083 1.1364 3.4977 1.6014 2.1685 1.6861 1.3679 2.9784 2.5820 2.9427 2.6224 2.2047 2.0054 2.6867 3.4010 2.2245 2.7743 2.9807 2.6293 1.8522 2.0260 1.0665 1.2319 2.3837 1.2877 1.3687 1.1645 1.2193 1.4445 1.2315 1.3677 1.2865 1.2734 1.4529 1.2151 1.4889 1.0896 1.2081 1.1033 1.2511 1.1105 1.0924 1.0597 1.0674 1.8886 5.2350 6.5527 1.0690 1.0681 1.0654 1.0670 1.0670 1.0354 1.0648 1.0940 1.0923 1.0937 1.0991 1.0981 1.0959 1.0975 1.1023 1.0818 1.0767
irintensity: 0.0674 0.1481 0.3778 1.1434 4.2084 7.0089 6.2116 3.3513 2.1254 5.1121 3.1140 8.1667 12.9033 20.3436 4.7223 0.9353 2.1678 5.3216 2.2564 9.1213 26.0421 3.0144 7.9908 2.1808 1.7250 13.4447 10.7588 135.1023 23.1290 0.9100 1.1825 15.6450 56.1953 24.4380 3.4621 3.0852 21.9224 14.2172 22.1602 12.2944 60.2204 2.6744 3.9855 14.5123 36.2900 9.6888 38.1622 1.5650 9.8419 208.0032 9.4550 21.2388 19.9235 7.4562 13.5945 4.4139 1.4465 8.8631 12.7198 10.2898 18.1914 224.7352 7.1839 36.1194 27.8307 41.3239 14.8947 45.3401 18.8917 23.2897 458.8924 53.7761 386.3308 43.0150 88.7450 38.6830 22.9085 96.8723 28.4289 46.5747 3.4134 44.0036 30.4164 4.4117 47.9347 35.1026 30.0684 34.0337 156.1723 234.5168
temp: 298.150 k
press: 1.00000 atm
elementType: 8 8 8 7 7 7 6 6 6 6 6 6 6 6 6 1 1 1 1 1 1 1 1 1 1 1 1 1 1 1 1 1
symmnumber: 1
zpe: 703947.1 jmol-1
zpe.correction: 0.268119 hartree
zpe.thermalcorrener: 0.283635 hartree
zpe.thermalcorrenthalpy: 0.284579 hartree
zpe.thermalcorrgfe: 0.223165 hartree
zpe.sumelectzpe: -741.906128 hartree
zpe.sumelectthermal: -741.890612 hartree
zpe.sumelectthermalent: -741.889668 hartree
zpe.sumelectthermalfe: -741.951082 hartree
dipole: 1.2438 2.1054 0.2880
dipole: 2.4623
quadrupole: -87.7903 -100.8673 -87.4739
quadrupole: 4.8022 -5.4870 -5.8636
quadrupole: 4.2535 -8.8235 4.5699 4.8022 -5.4870 -5.8636
hfenergy: -742.1742468 hartree
pointgroup: C01 [X(C9H17N3O3)]
dipole: 0.5673336 -0.5874849 0.5210003 debye
polarizability: 158.3810886|7.3832172|117.5279744|5.3918718|-10.5986026|108.4263239 unknown
InChI: InChI=1S/C9H17N3O3/c1-2-10-9(14)11-8(13)7-12-3-5-15-6-4-12/h10-11H,2-7H2,1H3
charge 0 multiplicity 1
32 atoms
O  4.055088 1.112899 -0.957618
O  -1.193184 -1.746644 1.624433
O  -2.263424 1.859012 -0.400905
N  1.870625 0.041161 0.618867
N  -0.798113 0.325027 0.575967
N  -3.127188 -0.09028 0.60084
C  2.192926 -0.510971 -0.729718
C  3.090542 0.595416 1.26962
C  2.842176 0.57944 -1.598293
C  3.71531 1.668833 0.362032
C  1.113957 -0.910822 1.459594
C  -0.406061 -0.831256 1.219556
C  -2.123048 0.762329 0.215584
C  -4.538437 0.190862 0.293737
C  -5.084251 -0.686494 -0.853662
H  1.259711 -0.861881 -1.20893
H  2.887506 -1.380356 -0.644439
H  3.846291 -0.202194 1.464407
H  2.806478 1.049104 2.237603
H  3.173504 0.168395 -2.565513
H  2.115353 1.401708 -1.774094
H  3.004962 2.515249 0.242142
H  4.664909 2.038641 0.781728
H  1.279362 -0.669567 2.527061
H  1.416956 -1.97167 1.320964
H  -0.01344 0.947259 0.317639
H  -5.136258 0.032829 1.211511
H  -4.607129 1.257968 0.022665
H  -2.845913 -0.960594 1.081953
H  -4.5229 -0.498043 -1.785257
H  -5.003777 -1.761743 -0.610373
H  -6.149736 -0.455117 -1.037198
