program: Gaussian 09
title: 000284909
version: EM64L-G09RevD.01
frameworkgroup: C1[X(C6H2ClN3O2)]
method: RPBEPBE
basis: SDD
operation: Freq
keyword: #p
keyword: freq=noraman
keyword: PBEPBE/SDD
title: #p freq=noraman PBEPBE/SDD
converged: YES YES YES YES
title: Mulliken charges:
elementType: Cl O O N N N C C C C C C H H
charge: 0.013390 -0.184396 -0.149430 0.002799 0.032981 0.026737 0.265513 -0.177541 0.063141 -0.033005 -0.356429 -0.118258 0.323836 0.290660
chargesum: 0.00000
title: Mulliken charges with hydrogens summed into heavy atoms:
elementType: Cl O O N N N C C C C C C
charge: 0.013390 -0.184396 -0.149430 0.002799 0.032981 0.026737 0.265513 0.146295 0.063141 -0.033005 -0.065769 -0.118258
polarizability: 1.65472030e+02 -1.49395889e+01 1.10085342e+02 6.95474156e-04 -8.44198367e-03 3.73557321e+01
1716.lowfreq: 0.0010 0.0026 0.0036 4.2052 7.4232 8.9699 30.7137 70.6202 147.8806
frequency: 30.7044 70.6137 147.8790 155.2041 164.0922 242.6761 288.4145 342.6092 367.1917 426.9015 428.1050 438.5223 557.2889 579.8081 613.3220 662.6244 686.2580 740.9486 775.3178 856.2593 917.2437 947.4780 1030.5031 1089.9507 1193.4120 1194.2767 1222.6388 1312.2523 1346.7703 1382.5425 1419.7274 1527.9353 1560.4326 2191.0996 3163.1654 3189.6580
redmass: 15.8083 10.3460 6.6037 14.6991 16.0715 7.9807 10.5606 17.2505 9.3330 7.6242 13.7369 6.3576 3.6972 9.1861 11.4696 8.5333 10.4388 10.1528 6.8727 9.8307 1.5159 1.3724 4.9828 2.4925 7.7295 2.9503 3.7111 4.5417 3.0843 7.6954 2.8271 9.3344 8.0008 12.6335 1.0936 1.0936
irintensity: 0.2304 1.0063 4.9405 2.5184 2.0956 0.1739 2.6043 2.5180 2.5111 0.0669 1.1191 2.6770 13.1569 1.4727 15.9094 18.2194 0.0051 26.7159 13.0451 23.7654 21.3068 7.7693 26.3220 32.4120 191.1995 1.5009 25.1240 5.7704 23.5136 47.5553 138.8749 37.8225 11.7280 5.5480 2.2765 13.6949
temp: 298.150 k
press: 1.00000 atm
elementType: 17 8 8 7 7 7 6 6 6 6 6 6 1 1
symmnumber: 1
zpe: 198961.9 jmol-1
zpe.correction: 0.075781 hartree
zpe.thermalcorrener: 0.085917 hartree
zpe.thermalcorrenthalpy: 0.086861 hartree
zpe.thermalcorrgfe: 0.038337 hartree
zpe.sumelectzpe: -1003.637054 hartree
zpe.sumelectthermal: -1003.626918 hartree
zpe.sumelectthermalent: -1003.625974 hartree
zpe.sumelectthermalfe: -1003.674498 hartree
dipole: -5.4934 0.2797 -0.0002
dipole: 5.5006
quadrupole: -88.7542 -84.0016 -72.3918
quadrupole: 4.4606 -0.0009 0.0016
quadrupole: -7.0383 -2.2857 9.3240 4.4606 -0.0009 0.0016
hfenergy: -1003.7128347 hartree
pointgroup: C01 [X(C6H2Cl1N3O2)]
dipole: 2.1584073 -0.1566335 -0.0000763 debye
dipolederiv: -0.8577575 0.1769178 -0.0000042 0.2275089 -0.1144907 -0.0000041 -0.0000065 -0.0000034 -0.0148802 -0.4744796 -0.0022221 -0.0000193 0.0530553 -0.8198873 -0.0000441 -0.0000148 -0.000032 -0.2131296 -0.6513452 0.0316563 -0.0000452 -0.0515422 -0.5156649 -0.0000337 -0.0000377 -0.0000127 -0.1766304 -0.419703 0.0030618 0.0000016 0.0362566 -0.2470205 -0.0000069 -0.0000163 0.0000138 -0.2137518 1.1551536 0.2064925 0.0000997 0.15551 1.3594429 0.0000933 0.0000784 0.0000788 0.1997085 -0.0591062 -0.0760851 -0.0000949 -0.0357594 -0.1935018 0.0000412 -0.0000749 0.0000363 -0.2036924 -0.1503961 -0.3023795 -0.0000453 -0.1315479 -0.2626086 -0.0000375 -0.0000489 -0.0000376 0.0949755 -0.2771101 0.2317886 0.0000173 -0.0940846 0.0091244 -0.0000007 -0.0000164 0.0000085 -0.026442 0.4214447 -0.1887337 -0.0000214 -0.0999764 0.3720447 0.0000286 -0.0000129 0.0000026 0.2014286 1.3334843 -0.3231496 0.0000094 -0.4494614 -0.1121144 -0.0000218 0.0000079 -0.000016 -0.0246014 -0.0196439 0.1060963 0.000009 0.2783428 0.2520033 0.0000279 0.0000285 0.000026 0.0197284 -0.1688586 0.1789423 0.0000981 0.1271011 0.0603059 -0.0000308 0.0001208 -0.0000477 0.0442553 0.1535613 -0.0001446 0.0000013 0.0355178 0.1253227 -0.0000041 0.0000026 -0.0000052 0.173065 0.0147563 -0.0422412 -0.0000061 -0.0509205 0.0870443 -0.0000072 -0.0000098 -0.0000115 0.1399668 unknown
polarizability: 164.8017695|-16.120346|110.7556025|-0.0005132|0.008455|37.3557321 unknown
InChI: InChI=1S/C6H2ClN3O2/c7-4-1-6(10(11)12)5(2-8)9-3-4/h1,3H
charge 0 multiplicity 1
14 atoms
Cl 3.938094 -0.405894 0.000069
O  -0.789523 -2.81263 -0.00027
O  -2.421173 -1.214418 -0.000286
N  0.527867 1.815965 0.000182
N  -1.191185 -1.587498 -0.000237
N  -2.866749 1.94933 0.000377
C  -0.144059 -0.522934 -0.000092
C  1.202694 -0.94105 -0.000085
C  -0.466771 0.864881 0.000047
C  2.194977 0.052017 0.000053
C  1.824789 1.419235 0.000178
C  -1.809532 1.393499 0.000066
H  1.434415 -2.008881 -0.000182
H  2.580955 2.210577 0.000279
