program: Gaussian 09
title: 000284946
version: EM64L-G09RevD.01
frameworkgroup: C1[X(C18H15NO3)]
method: RPBEPBE
basis: SDD
operation: Freq
keyword: #p
keyword: freq=noraman
keyword: PBEPBE/SDD
title: #p freq=noraman PBEPBE/SDD
converged: YES YES NO NO
title: Mulliken charges:
elementType: O O O N C C C C C C C C C C C C C C C C C C H H H H H H H H H H H H H H H
charge: -0.253886 -0.445054 -0.255731 -0.039315 0.323202 -0.144810 0.031873 0.175468 0.360590 -0.376862 -0.505513 -0.328490 0.325121 -0.375182 -0.373490 -0.353689 0.444022 -0.365016 -0.436111 0.112286 -0.811053 -0.537163 0.269642 0.320399 0.263758 0.278000 0.218010 0.248335 0.228667 0.229599 0.225249 0.234974 0.228777 0.250147 0.223144 0.223022 0.387080
chargesum: 0.00000
title: Mulliken charges with hydrogens summed into heavy atoms:
elementType: O O O N C C C C C C C C C C C C C C C C C C
charge: -0.253886 -0.057974 -0.255731 -0.039315 0.323202 -0.144810 0.031873 0.175468 0.360590 -0.107220 -0.185115 -0.064732 0.325121 -0.097182 -0.155481 -0.105355 0.444022 -0.136350 -0.206512 0.112286 -0.122052 0.159151
polarizability: 4.37319262e+02 2.21347896e+01 2.40243350e+02 4.70752403e-01 1.03151770e+00 9.09765130e+01
1716.lowfreq: -4.8210 -2.9227 0.0003 0.0007 0.0008 5.2183 18.7365 30.1818 36.8559
frequency: 18.3699 30.1344 36.8360 44.4621 77.0800 78.4481 87.9373 135.7554 143.0766 186.7608 191.8413 216.0925 233.3486 243.1806 275.4761 293.9729 332.4418 344.2344 391.6028 399.0961 404.1485 414.3660 439.1806 497.5205 503.3847 507.7138 547.3510 577.2915 582.4794 583.5715 610.9969 625.6060 638.3610 688.2038 704.6500 728.2754 746.1732 765.3988 787.0446 802.1095 829.0226 833.8560 849.2745 859.9747 891.9659 924.0926 936.4946 957.2061 961.6058 965.8245 985.0416 1001.8548 1002.0090 1010.1047 1047.3289 1062.8115 1068.2480 1111.5939 1124.8286 1136.4355 1154.1532 1177.4421 1197.0515 1217.9149 1227.0855 1259.7158 1285.2029 1291.2079 1314.3461 1326.9109 1347.0620 1368.7310 1374.5275 1396.5565 1406.0998 1419.2280 1435.8775 1463.8463 1469.5066 1470.9364 1472.5250 1473.9239 1495.0042 1513.9263 1533.0520 1572.2670 1579.9091 1620.9022 1624.9536 1637.5177 2964.0986 2974.0451 3052.8170 3054.6119 3085.9283 3120.2184 3122.4917 3128.9101 3149.7577 3152.5931 3165.8917 3173.9123 3190.1040 3198.2823 3530.7206
redmass: 3.7425 1.1678 3.2938 9.9947 4.1742 4.2573 3.9882 4.6568 6.0438 4.3156 2.9419 4.8115 5.4792 1.3831 4.1573 3.9481 7.1959 4.0315 5.0046 4.5491 2.9320 3.4379 6.9511 2.8051 3.5340 5.2470 5.0510 6.3267 1.7020 5.1770 2.1380 5.1472 6.9425 3.5969 6.2712 3.0804 5.2862 5.2018 2.6770 5.6569 1.8468 1.5240 8.8834 1.3021 6.9566 1.5180 1.5819 6.0472 1.3637 1.3408 1.4266 1.3656 3.9547 2.9691 1.5700 2.7078 3.0469 1.2559 1.3172 1.4016 1.5123 1.5439 1.1556 2.5180 2.7259 1.8215 1.9676 2.4247 1.6868 4.4885 3.3430 4.3536 4.1672 1.2422 6.4100 3.5954 1.2925 2.4452 1.0573 1.0499 1.0920 1.1575 3.8823 3.1225 6.2778 7.1755 6.0593 6.3680 6.6223 8.5438 1.0329 1.0383 1.0957 1.1042 1.0992 1.0894 1.0883 1.0995 1.0951 1.0871 1.0942 1.0972 1.0921 1.0907 1.0642
irintensity: 0.0023 0.7183 0.1732 2.2591 0.5645 0.5364 4.4282 1.1328 2.3662 0.0919 3.6418 2.1219 0.6210 0.5610 4.7431 4.4257 0.5776 2.0141 0.0207 1.2507 0.4043 9.4381 1.7844 11.1586 9.3779 7.9517 23.4789 1.6930 107.5767 49.8154 39.3766 26.8926 0.8775 3.4644 10.8888 0.1700 28.1121 0.8549 5.9239 2.4619 43.2236 29.6396 7.2995 19.4684 3.0361 25.4269 15.3437 115.4291 1.9106 3.0281 2.4747 2.0726 67.0886 14.6893 18.2299 259.2796 39.0230 0.2213 10.9175 29.9555 119.8920 49.6618 56.0984 146.8329 3.5294 172.9326 56.4418 11.5978 11.5136 27.8585 102.6381 18.1472 10.7811 8.1411 2.2050 2.3176 8.8576 16.4142 13.5808 13.7977 28.1504 48.6866 131.0741 2.0483 144.5350 63.1056 20.3933 17.8595 78.7980 277.8697 102.6871 45.4916 22.1404 45.7537 18.9443 16.5196 35.5460 25.0049 19.3824 4.9565 5.2763 13.2854 13.1940 0.2888 55.3403
temp: 298.150 k
press: 1.00000 atm
elementType: 8 8 8 7 6 6 6 6 6 6 6 6 6 6 6 6 6 6 6 6 6 6 1 1 1 1 1 1 1 1 1 1 1 1 1 1 1
symmnumber: 1
zpe: 745664.2 jmol-1
zpe.correction: 0.284008 hartree
zpe.thermalcorrener: 0.303387 hartree
zpe.thermalcorrenthalpy: 0.304331 hartree
zpe.thermalcorrgfe: 0.233911 hartree
zpe.sumelectzpe: -973.819813 hartree
zpe.sumelectthermal: -973.800434 hartree
zpe.sumelectthermalent: -973.799490 hartree
zpe.sumelectthermalfe: -973.869910 hartree
dipole: 0.2611 -1.5536 0.0629
dipole: 1.5766
quadrupole: -101.6153 -107.5802 -132.6702
quadrupole: 18.2797 0.2251 0.1783
quadrupole: 12.3399 6.3750 -18.7149 18.2797 0.2251 0.1783
hfenergy: -974.1038212 hartree
pointgroup: C01 [X(C18H15N1O3)]
dipole: -0.1207564 -0.5530157 -0.2536435 debye
polarizability: 435.6611689|-28.5344576|221.533772|-4.2979331|51.3976209|111.3441846 unknown
InChI: InChI=1S/C18H15NO3/c1-11-3-5-12(6-4-11)17-10-15(18(20)21)14-9-13(22-2)7-8-16(14)19-17/h3-10,20H,1-2H3
charge 0 multiplicity 1
37 atoms
O  5.342569 -0.88756 -0.126626
O  0.636911 3.512429 1.602208
O  2.8343 2.837679 1.36156
N  -0.267158 -1.046207 -0.280982
C  1.83689 0.196887 0.262263
C  1.108483 -0.968613 -0.224157
C  -1.010532 0.011926 0.134399
C  1.015621 1.309694 0.702934
C  -2.492978 -0.116958 0.050513
C  -0.3791 1.200338 0.632769
C  3.258713 0.167328 0.272608
C  1.84637 -2.108578 -0.675991
C  3.946599 -0.97027 -0.180606
C  -3.066496 -1.337688 -0.403498
C  -3.374583 0.938237 0.408468
C  3.239706 -2.122032 -0.660034
C  -5.345322 -0.437365 -0.140901
C  -4.460879 -1.492838 -0.494244
C  -4.77311 0.776757 0.314134
C  1.614417 2.567989 1.230317
C  -6.848549 -0.602378 -0.27012
C  6.124997 -2.037169 -0.592091
H  -0.977508 2.046141 0.97233
H  3.827189 1.026959 0.631575
H  1.270193 -2.96645 -1.03477
H  -2.387471 -2.150553 -0.676886
H  -2.985807 1.898028 0.764185
H  3.779513 -3.006096 -1.011602
H  -4.876261 -2.446498 -0.843577
H  -5.430586 1.607238 0.598343
H  -7.391743 0.217134 0.230679
H  -7.156999 -0.605492 -1.333948
H  -7.190102 -1.558241 0.167428
H  7.174334 -1.737228 -0.458178
H  5.932497 -2.250236 -1.661227
H  5.916182 -2.939942 0.013676
H  1.103901 4.32143 1.943649
