program: Gaussian 09
title: 000284924
version: EM64L-G09RevD.01
frameworkgroup: C1[X(C18H14O3)]
method: RPBEPBE
basis: SDD
operation: Freq
keyword: #pfreq=noraman
keyword: PBEPBE/SDD
title: #p freq=noraman PBEPBE/SDD
converged: YES YES NO NO
title: Mulliken charges:
elementType: O O O C C C C C C C C C C C C C C C C C C H H H H H H H H H H H H H H
charge: -0.281983 -0.253356 -0.230184 0.235878 0.276598 -0.477609 0.304949 0.477256 -0.396143 0.106730 -0.395388 -0.377522 -0.372161 -0.358765 0.320176 -0.371571 -0.374016 -0.236717 -0.228396 -0.239619 -0.537121 0.250303 0.218449 0.229299 0.312618 0.225052 0.274963 0.255425 0.246525 0.227905 0.230261 0.231215 0.249199 0.228891 0.228860
chargesum: 0.00000
title: Mulliken charges with hydrogens summed into heavy atoms:
elementType: O O O C C C C C C C C C C C C C C C C C C
charge: -0.281983 -0.253356 -0.230184 0.235878 0.276598 -0.227306 0.304949 0.477256 -0.177694 0.106730 -0.166089 -0.064904 -0.147109 -0.083802 0.320176 -0.116147 -0.127491 -0.008812 0.001864 -0.008404 0.169830
polarizability: 6.00434053e+02 1.62419988e+01 1.98424857e+02 -3.56696850e-03 3.75053110e-02 8.31255113e+01
1716.lowfreq: -2.7475 -0.0009 -0.0006 -0.0001 2.2013 10.4491 23.3952 37.9135 59.1179
frequency: 23.3064 37.9060 59.1153 69.0098 74.5400 109.1510 120.1787 149.9766 198.5667 205.4162 218.0795 220.4368 263.7129 270.2285 333.0824 379.5232 389.0123 395.4437 401.3517 432.0324 469.0562 488.9383 514.9801 533.3895 563.6733 613.3174 629.4155 638.1215 647.4660 692.8066 700.8905 732.8275 733.8302 748.8559 774.1161 774.2994 810.6220 824.5571 845.8017 848.0059 851.2261 859.4895 929.7149 930.1617 955.1750 969.8181 980.7686 981.1379 986.8115 1000.1526 1000.9554 1007.4317 1008.2657 1031.5487 1082.2606 1111.0258 1121.3738 1157.3711 1173.4245 1180.7686 1191.2394 1191.9226 1220.6598 1252.0299 1269.1600 1295.6741 1325.9310 1327.3354 1360.5632 1383.5725 1409.6547 1436.0104 1439.3203 1443.4406 1468.2276 1471.7831 1478.7834 1500.7087 1554.2238 1573.6389 1580.0055 1607.2469 1620.3190 1627.3337 1672.5615 2971.3455 3064.2074 3071.8065 3125.5505 3126.5721 3133.1595 3135.3852 3147.8780 3149.2626 3161.6074 3165.9446 3170.8683 3174.0765 3208.3596
redmass: 6.0743 3.6445 5.4514 4.8389 4.6189 4.3491 5.1523 4.9073 6.5166 6.0470 6.0001 1.3310 2.8654 4.0156 7.3399 5.4795 6.6535 3.2070 2.9155 3.2428 4.5292 3.6977 6.9756 2.4441 5.4040 6.4807 7.1098 3.6326 7.9070 1.8486 6.8677 3.8662 6.7633 4.3001 1.7704 6.7893 1.5939 1.3273 1.5045 5.3353 1.2630 9.2296 1.4519 1.4405 8.2452 1.4224 8.9852 1.3781 6.1778 2.7022 1.3288 1.3215 4.0573 1.9564 1.5907 1.2594 1.4526 1.3422 1.0950 1.5802 1.1828 1.3888 2.1067 2.5514 3.6691 3.0179 1.4662 1.4453 3.1324 7.2676 1.9157 1.1958 2.3836 3.1777 1.0498 1.1029 2.2427 2.3986 6.7278 6.2312 6.0824 6.4248 6.4981 7.2250 10.6337 1.0323 1.1044 1.0867 1.0893 1.0850 1.1004 1.0882 1.0938 1.0906 1.0972 1.0952 1.0957 1.0988 1.0975
irintensity: 1.5333 0.0499 1.0800 5.8950 0.4709 3.1099 1.6066 1.5472 2.4885 0.0356 0.2247 0.3448 1.5197 7.3899 10.1695 1.8249 6.8244 0.0011 0.1243 0.1206 5.0890 6.0978 31.9622 15.2399 19.9582 0.1507 2.8626 10.0484 2.6752 33.6433 3.4710 25.4694 15.1587 21.4007 70.5439 2.2177 19.1218 1.1079 46.4057 17.6791 1.6414 113.8038 1.9537 38.0232 125.2885 4.1146 96.1281 0.0827 0.2387 12.9268 0.4415 3.3909 22.2211 14.1463 11.2150 0.1462 29.6093 12.7958 0.1104 4.0325 30.2797 255.8603 64.8981 181.7220 77.3633 122.5643 1.9899 9.8949 6.1400 14.6925 94.0896 12.8249 15.1686 2.1981 14.8589 112.2289 33.5748 94.3470 3.8450 186.8832 125.4515 44.9146 220.2581 21.1930 184.8186 91.4569 40.2470 16.5210 10.7549 5.0933 27.5074 1.4934 28.6572 5.3417 37.4377 16.3809 20.8956 18.9374 13.0361
temp: 298.150 k
press: 1.00000 atm
elementType: 8 8 8 6 6 6 6 6 6 6 6 6 6 6 6 6 6 6 6 6 6 1 1 1 1 1 1 1 1 1 1 1 1 1 1
symmnumber: 1
zpe: 704368.9 jmol-1
zpe.correction: 0.268280 hartree
zpe.thermalcorrener: 0.285906 hartree
zpe.thermalcorrenthalpy: 0.286850 hartree
zpe.thermalcorrgfe: 0.221317 hartree
zpe.sumelectzpe: -918.512336 hartree
zpe.sumelectthermal: -918.494710 hartree
zpe.sumelectthermalent: -918.493766 hartree
zpe.sumelectthermalfe: -918.559299 hartree
dipole: 1.7617 2.4335 0.0035
dipole: 3.0042
quadrupole: -83.3487 -112.6414 -128.4929
quadrupole: -13.7675 0.0387 0.0209
quadrupole: 24.8123 -4.4804 -20.3319 -13.7675 0.0387 0.0209
hfenergy: -918.7806159 hartree
pointgroup: C01 [X(C18H14O3)]
dipole: 0.6848011 0.9028629 0.3359745 debye
polarizability: 600.1236437|18.5562907|184.7383674|6.6459851|37.7127934|97.12241 unknown
InChI: InChI=1S/C18H14O3/c1-20-16-9-7-13(8-10-16)11-15-12-17(21-18(15)19)14-5-3-2-4-6-14/h2-12H,1H3
charge 0 multiplicity 1
35 atoms
O  -1.85959 -1.252117 -0.601106
O  6.604602 0.146591 -0.092052
O  0.331807 -1.992466 -0.872622
C  -0.204351 0.320419 -0.01509
C  -2.485471 -0.044801 -0.152228
C  -1.529506 0.885974 0.194811
C  -3.944396 -0.035025 -0.149376
C  2.392419 0.676037 0.115475
C  0.983751 1.005012 0.239897
C  -0.426097 -1.06265 -0.52908
C  3.331677 1.697817 0.490348
C  2.925408 -0.569745 -0.346139
C  -4.664431 1.117464 0.279123
C  -4.670655 -1.183028 -0.576902
C  5.21431 0.250168 -0.049945
C  4.71248 1.49726 0.412184
C  4.312719 -0.780255 -0.428373
C  -6.072068 1.118874 0.279156
C  -6.080401 -1.17468 -0.574259
C  -6.788386 -0.026869 -0.147349
C  7.18891 -1.118497 -0.556651
H  -1.722732 1.890691 0.568129
H  0.815675 2.025784 0.619962
H  2.953201 2.663363 0.848351
H  2.239521 -1.369409 -0.638786
H  -4.12163 2.009548 0.611306
H  -4.116187 -2.066846 -0.905852
H  5.424501 2.276749 0.698244
H  4.680775 -1.745846 -0.787476
H  -6.614361 2.011163 0.610928
H  -6.627895 -2.063926 -0.905357
H  -7.88388 -0.022605 -0.146068
H  8.276341 -0.967248 -0.500454
H  6.892223 -1.95897 0.098796
H  6.893314 -1.33433 -1.600749
