program: Gaussian 09
title: 000285003
version: EM64L-G09RevD.01
frameworkgroup: C1[X(C22H24N2O6)]
method: RPBEPBE
basis: SDD
operation: Freq
keyword: #p
keyword: freq=noraman
keyword: PBEPBE/SDD
title: #p freq=noraman PBEPBE/SDD
converged: YES YES NO NO
title: Mulliken charges:
elementType: O O O O O O N N C C C C C C C C C C C C C C C C C C C C C C H H H H H H H H H H H H H H H H H H H H H H H H
charge: -0.265823 -0.133864 -0.240684 -0.311126 -0.253871 -0.281867 -0.238168 -0.014842 -0.182171 -0.080328 0.158565 0.034230 -0.178070 -0.473750 0.340045 -0.421591 0.259435 -0.453840 0.283720 -0.696472 0.433229 -0.054344 -0.406718 -0.320169 -0.257807 -0.246872 -0.233104 -0.247681 -0.671274 -0.666183 0.289486 0.315973 0.257019 0.253218 0.244708 0.220148 0.256881 0.216926 0.248115 0.221769 0.236716 0.291866 0.233505 0.222385 0.232349 0.236425 0.218497 0.236038 0.251677 0.229932 0.215795 0.216773 0.253967 0.221227
chargesum: 0.00000
title: Mulliken charges with hydrogens summed into heavy atoms:
elementType: O O O O O O N N C C C C C C C C C C C C C C C C C C C C C C
charge: -0.265823 -0.133864 -0.240684 -0.311126 -0.253871 -0.281867 -0.238168 -0.014842 0.107315 0.235646 0.158565 0.034230 -0.178070 0.036487 0.340045 0.043266 0.259435 -0.196959 0.283720 -0.009662 0.433229 -0.054344 -0.170002 -0.028303 0.198082 -0.014523 0.003322 0.206854 0.026130 0.025784
polarizability: 3.48485907e+02 2.42734620e+01 2.98758135e+02 -5.07531388e-01 -4.14329384e+00 1.83727638e+02
1716.lowfreq: 0.0004 0.0005 0.0007 3.1448 3.1748 4.9698 18.9534 27.6607 33.8928
frequency: 18.6116 27.6497 33.8845 38.2760 46.7712 52.0341 64.3243 69.4233 77.7809 90.3907 91.9200 102.1291 110.1904 113.5744 136.7062 147.2363 155.2557 177.3665 187.6788 203.7866 211.7290 225.3613 241.6830 249.1655 258.6135 278.9031 289.1530 293.8397 311.4347 320.3246 345.8520 363.0833 398.8699 405.8888 413.6607 432.9013 452.6062 481.8850 501.6325 510.2235 519.6069 526.4231 556.6011 599.4505 612.1798 654.3385 673.0198 687.5711 695.8155 700.3037 714.9546 734.6812 740.8136 764.3967 767.4922 774.7655 796.0781 801.6716 807.1918 812.4008 816.5830 839.1712 872.1237 880.6757 887.7868 895.9544 901.3853 916.2678 926.7115 968.5382 973.1208 999.7986 1002.7819 1004.3131 1009.2830 1019.7353 1019.9605 1045.3144 1058.1167 1090.9423 1095.2357 1095.9038 1101.2191 1114.5526 1131.1041 1132.8480 1143.0453 1154.4079 1155.6960 1162.1032 1169.5585 1171.4124 1194.6465 1208.6006 1234.1146 1239.4011 1258.8860 1272.3584 1274.1323 1280.6353 1287.7807 1290.0855 1302.4700 1317.1207 1328.2582 1343.3392 1351.0906 1376.6867 1388.9791 1390.5514 1392.1566 1394.2017 1407.6825 1421.6146 1451.8844 1456.9039 1457.3870 1462.5422 1462.7863 1463.0672 1474.5170 1480.7172 1484.7766 1484.8596 1486.9566 1505.5156 1566.0938 1606.7283 1621.4596 1628.0362 1642.3202 1731.6223 2980.9082 2985.4001 2987.3703 2990.8153 2993.1430 3005.2002 3028.3591 3029.0130 3030.5412 3052.9557 3060.9565 3083.3391 3085.3341 3087.7117 3091.3149 3094.5531 3096.5251 3117.0394 3120.4350 3122.4852 3130.1348 3138.9398 3153.3700 3167.5988
redmass: 4.6214 3.9558 4.4660 4.3160 3.5342 4.2151 4.2717 3.0212 3.6002 4.2911 5.6808 3.8198 5.0420 4.5481 7.6604 4.1476 3.3289 2.1143 2.0944 3.0814 1.4188 1.6473 3.8674 2.2170 3.6514 3.4978 4.2159 3.4362 2.9177 3.8254 4.6156 5.7851 4.4130 3.7450 4.1388 5.4633 4.2274 2.9737 5.1779 4.3729 4.3747 6.4611 3.9035 5.3467 7.1068 6.5049 5.7541 5.3468 5.4943 10.1676 5.1705 4.8680 4.5917 2.2558 1.4569 1.9123 2.0863 2.8322 2.7508 1.3724 2.0833 4.6677 3.4721 1.5678 3.3970 4.2730 4.6509 1.6398 2.8215 2.9284 1.3807 2.9030 1.3556 2.7336 1.7942 3.0275 2.2139 4.4719 4.7860 2.4955 2.1311 2.1733 2.4437 2.3260 2.2078 2.9240 2.1862 1.6815 1.7005 2.2365 1.1669 1.0817 3.3613 1.5222 2.0529 1.7600 2.0135 1.2572 1.2296 1.1362 1.6663 1.8133 1.4977 2.0570 1.3877 1.7170 1.2977 2.1506 1.2524 1.2238 1.2127 4.6469 3.0308 4.4170 1.0875 1.0930 1.1041 3.2764 1.0457 1.0651 1.0418 1.0887 1.0540 1.0532 1.0513 3.8974 8.4262 9.4684 6.6270 7.7096 10.3603 12.7750 1.0814 1.0604 1.0355 1.0360 1.0362 1.0600 1.0660 1.0970 1.0594 1.0860 1.1013 1.1004 1.0976 1.0972 1.1031 1.1031 1.1010 1.1059 1.1059 1.0876 1.0928 1.0889 1.0949 1.1007
irintensity: 0.2865 0.8157 1.1180 0.3744 0.9317 3.4592 0.4619 0.3214 0.7107 0.1509 1.8401 0.5993 2.4199 0.8650 1.0579 4.7151 1.7364 3.7045 2.6955 0.2646 4.3162 0.6829 1.0690 2.7407 1.7086 0.5226 3.6197 5.3794 12.4486 17.3231 5.5638 27.3415 6.5456 4.0666 2.8500 0.9694 2.5530 7.4461 6.8004 5.9444 7.1734 12.0654 1.7849 5.8301 2.2359 5.2949 0.4830 1.5122 1.7550 21.4654 6.4920 9.0154 7.7662 17.0472 15.7047 40.5707 10.5251 4.2273 1.7133 8.1409 1.7449 20.0744 65.8217 10.3709 25.5914 6.0569 68.3419 25.3911 13.9568 15.6058 2.5643 23.1375 0.7864 31.2769 5.9147 36.4443 15.3300 186.2870 293.7523 30.4837 16.2756 18.8744 6.6335 65.0471 40.5342 1.8064 20.1374 25.2123 32.8558 24.1594 8.4692 0.2744 146.7364 11.2141 7.5030 13.5449 10.0272 23.2509 5.0469 17.6754 83.2583 36.1910 46.2282 61.8870 4.7732 124.9095 1.3631 233.1803 21.1889 8.4528 33.7955 10.0635 8.7757 32.0413 14.6441 7.6499 45.0223 1.5552 14.9993 19.6790 9.0158 13.3988 8.3383 31.5715 10.0826 36.4903 12.4632 86.4531 6.8594 48.0326 320.4346 219.2815 9.6672 22.3588 27.2235 22.5999 24.1222 13.1677 24.8398 24.5470 24.3244 8.1473 1.3443 54.9560 41.7689 24.7465 3.0014 0.5099 21.3001 32.8447 28.3456 3.1079 10.0008 12.7668 10.5849 30.8480
temp: 298.150 k
press: 1.00000 atm
elementType: 8 8 8 8 8 8 7 7 6 6 6 6 6 6 6 6 6 6 6 6 6 6 6 6 6 6 6 6 6 6 1 1 1 1 1 1 1 1 1 1 1 1 1 1 1 1 1 1 1 1 1 1 1 1
symmnumber: 1
zpe: 1110634.7 jmol-1
zpe.correction: 0.423018 hartree
zpe.thermalcorrener: 0.452113 hartree
zpe.thermalcorrenthalpy: 0.453057 hartree
zpe.thermalcorrgfe: 0.361110 hartree
zpe.sumelectzpe: -1411.373984 hartree
zpe.sumelectthermal: -1411.344890 hartree
zpe.sumelectthermalent: -1411.343946 hartree
zpe.sumelectthermalfe: -1411.435892 hartree
dipole: -1.4248 4.5721 2.5918
dipole: 5.4453
quadrupole: -154.4847 -156.9946 -175.8328
quadrupole: -5.5601 8.9581 1.7885
quadrupole: 7.9526 5.4428 -13.3954 -5.5601 8.9581 1.7885
hfenergy: -1411.7970025 hartree
pointgroup: C01 [X(C22H24N2O6)]
dipole: 1.377753 1.2754687 1.0318157 debye
polarizability: 313.2870587|-28.9097237|323.1324715|24.2758467|-34.668822|194.5521495 unknown
InChI: InChI=1S/C22H24N2O6/c1-4-22(20(26)28-5-2)19(25)18(30-22)17-16-14(12-24(17)21(27)29-6-3)11-13-9-7-8-10-15(13)23-16/h7-11,17-18H,4-6,12H2,1-3H3
charge 0 multiplicity 1
54 atoms
O  -2.68485 -0.287169 -0.745303
O  -0.078806 -1.237819 -2.621665
O  -1.88815 -1.608731 1.447566
O  -0.973633 4.889044 -1.229325
O  -0.876831 -3.376305 0.304144
O  -2.725808 3.318145 -1.001902
N  -0.48195 2.723017 -0.693455
N  0.885335 -0.462081 0.333325
C  -1.532895 0.469477 -1.363644
C  -0.767714 1.320165 -0.296217
C  -2.033463 -1.636544 -0.975169
C  -0.924773 -0.888447 -1.791627
C  0.630845 0.807636 0.011206
C  0.95258 3.119063 -0.59654
C  1.614291 1.836264 -0.149587
C  -2.919902 -2.590854 -1.795139
C  -1.527048 -2.30324 0.309505
C  2.949629 1.52515 0.081203
C  -1.499182 3.606988 -0.969521
C  -4.245797 -2.916355 -1.074864
C  3.286174 0.178269 0.452893
C  2.21746 -0.801969 0.552518
C  4.63155 -0.241633 0.705873
C  2.529448 -2.160521 0.86989
C  -1.39396 -2.17151 2.743799
C  4.909755 -1.571787 1.030615
C  3.854503 -2.536609 1.106117
C  -1.992032 5.942835 -1.514453
C  -2.324855 -3.276321 3.25101
C  -2.533707 6.548259 -0.216772
H  -1.880844 1.113349 -2.189246
H  -1.424612 1.282678 0.597064
H  1.32877 3.47952 -1.572302
H  1.077229 3.947307 0.126765
H  -2.334169 -3.50986 -1.98263
H  -3.12712 -2.117724 -2.772814
H  3.745361 2.271555 -0.027527
H  -4.886213 -3.546098 -1.71772
H  -4.794856 -1.98907 -0.836379
H  -4.068582 -3.465228 -0.13193
H  5.441817 0.494187 0.635446
H  1.705061 -2.880735 0.896356
H  -0.364962 -2.541626 2.59216
H  -1.387313 -1.296288 3.412587
H  5.941882 -1.885726 1.220584
H  4.093049 -3.578955 1.343551
H  -1.437475 6.680128 -2.117274
H  -2.803366 5.493423 -2.113474
H  -2.305596 -4.146636 2.574234
H  -3.361707 -2.907548 3.334878
H  -1.994814 -3.609585 4.252673
H  -3.222917 7.380818 -0.45184
H  -3.092297 5.792066 0.359759
H  -1.713839 6.945335 0.406899
