program: Gaussian 09
title: 000284890
version: EM64L-G09RevD.01
frameworkgroup: C1[X(C6Cl8O4)]
method: RPBEPBE
basis: SDD
operation: Freq
keyword: #pfreq=noraman
keyword: PBEPBE/SDD
title: #p freq=noraman PBEPBE/SDD
converged: YES YES NO NO
title: Mulliken charges:
elementType: Cl Cl Cl Cl Cl Cl Cl Cl O O O O C C C C C C
charge: 0.128581 0.128573 0.188563 0.148517 0.190829 0.188566 0.148519 0.190825 -0.145340 -0.145340 -0.093559 -0.093571 -0.095944 -0.095946 0.341560 0.341543 -0.663183 -0.663193
chargesum: 0.00000
title: Mulliken charges with hydrogens summed into heavy atoms:
polarizability: 1.68948567e+02 -3.99384933e-03 1.51790320e+02 -1.33681818e+01 2.53850725e-03 1.46674816e+02
1716.lowfreq: -6.7104 -1.4518 -0.0021 -0.0019 -0.0010 8.5484 23.8335 38.2043 40.5311
frequency: 23.8186 38.1633 40.5268 68.5320 76.9864 106.7468 124.3453 135.8155 150.6572 164.4562 170.5366 178.4710 207.1311 219.6904 228.6946 229.6672 261.5144 284.2047 290.7611 296.0846 306.2568 336.5102 339.9247 367.7672 368.9540 423.8296 432.1644 486.5353 558.5651 586.1277 633.9538 678.5229 679.3638 706.6238 718.1778 723.3652 763.8541 780.3269 806.9189 882.9655 937.3917 955.3236 1016.4484 1056.9479 1106.5498 1113.1100 1716.1416 1716.1595
redmass: 26.1835 20.6526 29.5201 31.6270 26.8376 21.7475 24.6990 27.1163 29.0667 26.9326 29.2841 33.2303 25.2671 26.9418 21.8035 27.7233 19.8631 27.4358 26.5220 26.2938 27.6467 19.5933 21.3506 30.2361 24.8797 14.7276 18.4431 15.5959 13.6967 13.3542 13.8299 12.8833 13.0241 13.3611 13.0761 13.8957 12.3655 12.6919 12.2430 13.5386 13.6732 12.6311 12.4588 12.8661 12.2659 12.2595 13.2133 13.2437
irintensity: 0.1838 0.0533 0.0164 0.0072 0.2195 0.0464 1.8350 0.0146 1.9478 0.4547 1.4324 0.0000 0.5811 0.0002 0.5498 0.4423 0.6827 0.0980 1.3116 0.0005 0.5908 17.0114 1.3579 0.4738 4.2967 0.5099 27.8401 5.5660 55.9467 11.3075 14.2695 98.3825 38.7435 130.5413 196.9892 126.0474 14.2697 1.9718 14.0205 236.8644 13.9604 31.0875 4.8634 481.0783 457.2023 2.4111 385.6154 18.9380
temp: 298.150 k
press: 1.00000 atm
elementType: 17 17 17 17 17 17 17 17 8 8 8 8 6 6 6 6 6 6
symmnumber: 1
zpe: 146516.1 jmol-1
zpe.correction: 0.055805 hartree
zpe.thermalcorrener: 0.075459 hartree
zpe.thermalcorrenthalpy: 0.076404 hartree
zpe.thermalcorrgfe: 0.005271 hartree
zpe.sumelectzpe: -4208.583244 hartree
zpe.sumelectthermal: -4208.563590 hartree
zpe.sumelectthermalent: -4208.562646 hartree
zpe.sumelectthermalfe: -4208.633778 hartree
dipole: -0.0003 0.6543 -0.0003
dipole: 0.6543
quadrupole: -155.7994 -152.8799 -167.3882
quadrupole: 0.0012 1.9458 -0.0058
quadrupole: 2.8897 5.8093 -8.6990 0.0012 1.9458 -0.0058
hfenergy: -4208.6390493 hartree
pointgroup: C01 [X(C6Cl8O4)]
dipole: -0.0000728 0.0002716 0.2574232 debye
dipolederiv: -0.2032054 0.0100002 0.0310495 -0.0073464 -0.1004408 -0.0172729 0.2125128 0.0718104 -0.5518006 -0.2032731 0.0099316 -0.0311404 -0.0077065 -0.1005683 0.0164959 -0.2126023 -0.0726165 -0.5516686 -0.1893737 0.2033299 0.0359356 0.1828445 -0.566922 -0.1029185 0.0090978 -0.09201 -0.1021551 -0.2474577 0.0363738 0.0636849 0.0412583 -0.114151 -0.0341034 0.1476908 -0.0677733 -0.6579124 -0.3538717 -0.3009887 0.1084505 -0.2281725 -0.3492766 0.1225553 0.083692 0.1203347 -0.1284778 -0.1893829 0.203281 -0.0362808 0.1828347 -0.5665619 0.1037102 -0.0093976 0.0927884 -0.1024983 -0.2474534 0.0362458 -0.0638522 0.040977 -0.1139489 0.0331407 -0.1478477 0.0667952 -0.6580412 -0.3539114 -0.3012044 -0.1078711 -0.2283428 -0.3497192 -0.122132 -0.0832466 -0.1199029 -0.1280277 -1.8120448 -0.47159 0.2020826 -0.4035371 -0.5426232 0.1293361 -0.0263008 0.0125506 -0.2936581 -1.812179 -0.4719999 -0.2008698 -0.4035318 -0.5429058 -0.128806 0.0272509 -0.0119977 -0.2933697 -0.7091673 -0.1256804 -0.0703442 -0.3634401 -0.7304151 -0.1244959 -0.0952889 -0.0928337 -0.2304557 -0.7091588 -0.1255569 0.0706676 -0.3631763 -0.7299708 0.1254549 0.0962751 0.0939796 -0.2309113 0.6889425 0.1918464 -0.0766632 0.6117413 0.2132608 -0.2205411 -0.1798219 -0.1793625 0.8844845 0.6890568 0.1920395 0.0763868 0.6121591 0.2139823 0.2216596 0.1787915 0.180515 0.8837036 1.9626889 0.4293255 -0.1122511 0.1166243 1.0157899 -0.2084602 0.0213812 -0.1616956 0.1692197 1.9627452 0.4295899 0.1110622 0.1166539 1.0164825 0.2068241 -0.0220581 0.1598428 0.1685275 0.863485 0.0273672 -0.1755611 0.049812 1.1740574 0.0107681 -0.2953091 0.0448568 0.9114949 0.8635608 0.0276895 0.1755143 0.0503484 1.1739308 -0.0112151 0.295181 -0.0452812 0.9115461 unknown
polarizability: 170.2760814|12.1398963|145.3472986|-0.0133475|0.0006758|151.7903223 unknown
InChI: InChI=1S/C6Cl8O4/c7-3(5(9,10)11)1(15)17-4(8,2(16)18-3)6(12,13)14
charge 0 multiplicity 1
18 atoms
Cl -1.759317 0.096348 2.23171
Cl 1.75978 -0.09244 2.231539
Cl -3.509429 1.919975 -0.074756
Cl -2.454537 0.057621 -2.215085
Cl -4.06005 -1.022775 0.11137
Cl 3.50943 -1.920097 -0.072016
Cl 2.454155 -0.061538 -2.215454
Cl 4.06007 1.022984 0.108785
O  -0.672953 1.217213 -0.008675
O  0.672967 -1.217227 -0.006639
O  -1.290145 -2.371704 -0.090565
O  1.290176 2.37144 -0.095557
C  -1.455072 0.065032 0.361873
C  1.455159 -0.064393 0.361707
C  0.74827 1.284924 0.076399
C  -0.748243 -1.284773 0.078758
C  -2.82088 0.23661 -0.391684
C  2.820819 -0.237302 -0.39181
