program: Gaussian 09
title: 000284948
version: EM64L-G09RevD.01
frameworkgroup: C1[X(C21H16N2O6)]
method: RPBEPBE
basis: SDD
operation: Freq
keyword: #p
keyword: freq=noraman
keyword: PBEPBE/SDD
title: #p freq=noraman PBEPBE/SDD
converged: YES YES NO NO
title: Mulliken charges:
elementType: O O O O O O N N C C C C C C C C C C C C C C C C C C C C C H H H H H H H H H H H H H H H H
charge: -0.260705 -0.246797 -0.423933 -0.233696 -0.427212 -0.229324 -0.365373 -0.469007 -0.370868 0.279298 0.302743 0.184864 0.158607 -0.574990 -0.380503 -0.422922 -0.391431 0.543654 -0.494343 -0.237861 -0.230489 0.252694 -0.258492 0.185038 -0.276498 -0.250280 0.178908 -0.275421 0.176253 0.290072 0.329851 0.318605 0.245677 0.264915 0.240814 0.226121 0.231295 0.229223 0.322800 0.280578 0.267181 0.284363 0.256720 0.383856 0.386017
chargesum: 0.00000
title: Mulliken charges with hydrogens summed into heavy atoms:
elementType: O O O O O O N N C C C C C C C C C C C C C C C C C C C C C
charge: -0.260705 -0.246797 -0.040077 -0.233696 -0.041195 -0.229324 -0.046768 -0.146207 -0.080796 0.279298 0.302743 0.184864 0.158607 -0.245139 -0.134826 -0.158007 -0.150617 0.543654 -0.268221 -0.006566 -0.001266 0.252694 0.022085 0.185038 -0.009318 0.034083 0.178908 -0.018701 0.176253
polarizability: 4.68439652e+02 -5.59940324e+01 3.23484568e+02 1.90864365e+01 1.83036615e+01 1.56474213e+02
1716.lowfreq: -10.9632 -4.2128 -2.0854 -0.0003 0.0005 0.0008 1.6833 12.8238 17.7613
frequency: -10.6399 12.7462 17.7494 27.8425 39.7783 42.4555 46.4561 53.6257 86.7964 93.7493 112.2532 128.0018 138.1801 151.7885 155.0314 157.0662 159.8541 189.8067 199.3645 229.4550 243.4678 276.5613 336.4344 347.8961 359.7796 364.6414 381.0933 397.8640 440.2528 452.8944 477.6313 489.2430 519.0098 537.8128 541.0599 556.9366 573.8317 582.5513 586.7147 593.7952 604.8067 622.0151 641.1026 643.4765 654.5566 660.9260 669.9914 691.8616 725.2580 727.3785 737.1903 748.2877 756.3650 780.0065 815.8247 832.5897 850.7606 884.5997 887.0480 890.4524 924.4380 924.9907 938.7524 941.5532 949.5065 953.7242 966.4219 975.6312 990.4911 995.4094 995.7363 997.0454 1026.7865 1048.9081 1054.4128 1073.6493 1110.6828 1136.8178 1154.4623 1171.8380 1193.3096 1201.6792 1217.3583 1220.0321 1224.6206 1229.6525 1239.9413 1262.8058 1263.1487 1273.1814 1288.3472 1304.8729 1316.1740 1327.8545 1329.9853 1370.5595 1388.4964 1443.4600 1449.9965 1457.7354 1472.0610 1487.9621 1508.4877 1571.0826 1578.1545 1593.1513 1595.7953 1618.4667 1623.8125 1638.6109 1641.7453 1650.2901 1651.4910 2983.8794 3114.6024 3126.6603 3136.6090 3144.3927 3146.5439 3148.0456 3150.9344 3151.1252 3153.3702 3164.7923 3186.2508 3521.7451 3524.6286 3525.9089 3546.8270
redmass: 8.5084 8.8250 8.1044 6.5845 6.4145 10.8427 8.2193 8.5917 5.3273 6.6175 5.8711 4.9558 4.2056 3.7299 5.3501 4.3104 2.9531 6.7019 8.0282 6.1176 5.8616 4.8273 6.5544 4.7787 5.9313 7.2450 5.5417 4.9382 3.2157 3.6978 4.5139 4.2241 3.9756 3.8696 3.5497 1.8303 2.5540 2.0049 2.1284 3.1359 4.0545 3.2298 2.4170 1.4822 1.8640 3.9720 3.3439 5.4579 7.5741 8.2223 4.1325 2.3421 3.4015 2.0916 4.5997 1.6480 3.4382 1.7332 2.0696 2.1925 5.6552 5.7941 1.8291 3.6223 1.4034 1.4914 3.0498 2.9139 1.3355 1.3669 1.1294 2.9328 2.1198 2.4470 2.1524 3.2306 1.9518 2.0291 1.5110 1.1274 2.1237 1.6685 1.6441 1.3920 1.4190 2.2715 1.8567 1.3810 1.3857 2.0609 1.5482 1.7708 1.8997 2.1172 2.0868 5.9398 4.5921 3.0144 3.1711 3.0294 1.9886 3.8402 2.2850 7.6667 6.4697 6.6421 5.2402 7.1179 7.2323 8.2115 9.0509 6.3758 6.2749 1.0807 1.0889 1.0857 1.0896 1.0976 1.0968 1.0951 1.0866 1.0954 1.0877 1.1004 1.0934 1.0763 1.0642 1.0642 1.0781
irintensity: 4.4838 0.4242 1.7722 0.6158 0.1218 0.5673 0.6596 0.3625 4.4955 2.5041 3.5039 0.6376 0.0032 4.8051 2.1944 3.6778 4.6696 2.0054 1.1548 10.1679 1.8348 1.5626 2.8058 0.5450 12.1347 6.1618 15.3649 7.8065 15.0188 3.5293 14.7876 12.8197 17.0925 53.0045 71.5725 29.0507 43.2057 79.6515 9.3159 0.8750 20.9038 62.0851 90.9644 65.7241 9.8005 23.6324 10.2707 2.5225 33.4099 33.9061 6.1363 49.6275 3.1338 56.0168 24.8897 40.6871 1.7601 0.9886 2.3539 4.5308 3.0664 12.9451 16.1391 1.8062 0.6122 0.8913 27.2655 21.5142 0.3422 26.6951 73.9607 4.6828 9.1112 255.3351 414.4030 73.7470 1.9133 1.0438 29.4457 4.1873 9.0503 2.7402 31.6357 35.6557 5.6075 29.2369 42.9542 18.6556 37.3652 11.1342 2.0272 10.5604 18.5789 150.6753 124.6170 44.6617 39.7792 19.4268 106.9735 35.2273 259.3748 149.8524 121.8223 210.4434 180.1683 1.4463 13.0241 2.7703 36.8510 374.8720 237.5177 55.6527 30.6029 33.8230 18.2217 2.2389 2.6897 8.5809 1.4403 14.9390 3.5215 20.8521 4.3129 40.4111 4.4469 10.2400 48.0985 67.4550 17.0691
temp: 298.150 k
press: 1.00000 atm
elementType: 8 8 8 8 8 8 7 7 6 6 6 6 6 6 6 6 6 6 6 6 6 6 6 6 6 6 6 6 6 1 1 1 1 1 1 1 1 1 1 1 1 1 1 1 1
symmnumber: 1
zpe: 865006.9 jmol-1
zpe.correction: 0.329464 hartree
zpe.thermalcorrener: 0.354657 hartree
zpe.thermalcorrenthalpy: 0.355601 hartree
zpe.thermalcorrgfe: 0.270203 hartree
zpe.sumelectzpe: -1368.682792 hartree
zpe.sumelectthermal: -1368.657599 hartree
zpe.sumelectthermalent: -1368.656654 hartree
zpe.sumelectthermalfe: -1368.742052 hartree
dipole: -2.5972 -5.7355 -4.9258
dipole: 7.9940
quadrupole: -153.2686 -161.2982 -174.0040
quadrupole: 4.9961 -8.3402 -4.8097
quadrupole: 9.5883 1.5587 -11.1470 4.9961 -8.3402 -4.8097
hfenergy: -1369.0122556 hartree
pointgroup: C01 [X(C21H16N2O6)]
dipole: -0.4142907 -2.5772308 -1.754365 debye
polarizability: 484.9445755|-15.7320792|308.4483893|24.4818053|9.9847087|155.0054692 unknown
InChI: InChI=1S/C21H16N2O6/c24-17(7-9-19(26)27)22-12-5-6-14-13-3-1-2-4-15(13)21(16(14)11-12)23-18(25)8-10-20(28)29/h1-11,21-23,26,28H
charge 0 multiplicity 1
45 atoms
O  2.738805 2.284943 2.3203
O  -2.861649 0.960416 0.376108
O  0.580904 5.552833 -2.157988
O  2.256324 6.403067 -0.77894
O  -7.684374 -2.528783 0.45389
O  -7.8428 -0.288694 -0.174573
N  2.175682 1.277753 0.291252
N  -2.716447 -1.308662 -0.251775
C  2.136547 -0.083099 0.849739
C  0.965768 -0.923336 0.332824
C  3.347419 -0.965166 0.517296
C  1.443057 -2.172826 -0.161877
C  2.914463 -2.200594 -0.049221
C  -0.393224 -0.585713 0.322577
C  0.523349 -3.121533 -0.659078
C  4.709157 -0.703741 0.732172
C  3.856254 -3.190927 -0.403379
C  -1.31445 -1.542586 -0.194587
C  -0.848459 -2.8014 -0.672858
C  5.655564 -1.695753 0.368005
C  5.230427 -2.926934 -0.191593
C  2.454695 2.380357 1.083082
C  2.400922 3.718847 0.415747
C  -3.412729 -0.134847 0.040938
C  1.545804 4.061982 -0.588137
C  -4.902306 -0.226155 -0.060984
C  1.535442 5.441179 -1.13449
C  -5.655459 -1.330783 0.209406
C  -7.13545 -1.276275 0.132711
H  2.074488 0.061179 1.948444
H  -0.755861 0.37599 0.689964
H  2.067835 1.388651 -0.71888
H  0.859321 -4.093003 -1.036202
H  5.034237 0.243117 1.176795
H  3.538162 -4.146757 -0.83447
H  -1.57026 -3.53028 -1.063717
H  6.724144 -1.512468 0.524892
H  5.976436 -3.682386 -0.46241
H  -3.278001 -2.088276 -0.603557
H  3.06067 4.48113 0.848323
H  0.812306 3.368002 -1.013135
H  -5.403073 0.721602 -0.294503
H  -5.227601 -2.288708 0.526303
H  0.58342 6.483962 -2.509835
H  -8.676959 -2.477226 0.400223
