program: Gaussian 09
title: 000284929
version: EM64L-G09RevD.01
frameworkgroup: C1[X(C19H14N2O3)]
method: RPBEPBE
basis: SDD
operation: Freq
keyword: #p
keyword: freq=noraman
keyword: PBEPBE/SDD
title: #p freq=noraman PBEPBE/SDD
converged: YES YES NO NO
title: Mulliken charges:
elementType: O O O N N C C C C C C C C C C C C C C C C C C C H H H H H H H H H H H H H H
charge: -0.194289 -0.159366 -0.292179 -0.334209 -0.001956 0.154421 -0.175912 0.176348 -0.121773 0.365570 0.306836 0.292909 -0.137444 0.205653 -0.776125 -0.387991 -0.374620 -0.329181 -0.233487 -0.234067 -0.342043 -0.239045 -0.206850 -0.529415 0.249138 0.269220 0.268669 0.291384 0.293818 0.254083 0.240186 0.241063 0.258073 0.235587 0.234998 0.243040 0.245400 0.243558
chargesum: 0.00000
title: Mulliken charges with hydrogens summed into heavy atoms:
elementType: O O O N N C C C C C C C C C C C C C C C C C C C
charge: -0.194289 -0.159366 -0.292179 -0.334209 -0.001956 0.154421 -0.175912 0.176348 -0.121773 0.365570 0.306836 0.292909 -0.137444 0.205653 0.010901 -0.096607 -0.080802 -0.075098 0.006698 0.006996 -0.083969 -0.003458 0.028148 0.202583
polarizability: 3.29163643e+02 -8.58989041e+00 2.36105500e+02 -6.03566165e+00 3.31300864e+00 1.43986705e+02
1716.lowfreq: -10.0963 -6.2422 -0.0010 -0.0008 -0.0007 5.4429 31.7900 34.3524 55.8970
frequency: 31.6221 34.2840 55.8936 57.2373 90.8527 106.2472 125.8935 137.8961 139.2253 148.6581 176.6788 195.2035 201.2319 224.3410 254.3066 266.6485 288.4378 314.2612 349.8485 358.4548 380.3729 421.8059 427.9997 436.2273 455.0794 476.0300 484.9812 495.8287 548.7343 568.6385 624.2475 633.2540 642.5772 673.8016 678.5948 713.3759 715.0101 720.7654 730.2064 751.1991 764.1346 786.6922 808.9831 861.4874 867.0637 880.0361 937.9950 948.8257 951.7503 964.3376 984.7335 991.9620 997.5367 1003.3304 1014.4613 1037.0138 1042.6803 1052.4616 1067.7264 1085.3381 1108.6358 1116.6066 1148.1232 1168.5796 1170.8781 1193.1873 1209.3277 1217.9169 1251.8054 1260.3641 1272.7208 1304.3747 1360.6054 1375.3524 1391.7553 1396.9100 1418.1117 1426.3155 1436.0237 1449.8802 1452.3718 1463.9431 1464.6854 1466.7756 1475.7459 1476.7035 1487.4377 1503.7282 1550.7678 1563.0766 1583.1288 1598.6270 1609.3763 1611.5249 2983.1599 2990.0096 3066.9795 3086.6706 3118.1817 3128.6416 3136.3084 3139.5858 3148.8965 3149.3417 3158.6415 3165.7406 3170.1950 3177.3117
redmass: 6.0659 5.7447 6.0733 5.4155 2.9999 4.2052 4.5426 3.6304 2.0010 1.5496 1.8878 3.4636 2.2563 6.6671 3.3601 6.3699 6.2687 4.5624 10.4692 7.2264 4.8631 4.1921 3.7973 5.7057 5.0615 10.8007 5.9123 4.1163 4.9363 4.1675 6.2115 6.3239 6.0208 5.9181 6.4981 5.4435 6.2505 5.6269 2.6827 4.3439 1.4499 4.1281 1.7949 2.9472 1.4601 6.1912 1.8496 2.1168 2.8080 8.3792 1.3496 3.7236 1.3970 2.4269 1.3646 1.9893 2.0108 1.5046 4.9478 2.3504 1.2327 1.9585 1.3223 1.0678 1.0922 2.2338 3.7111 3.1912 3.8712 1.7599 1.7445 4.0283 7.3491 10.5116 8.8804 1.2921 3.9639 1.5363 2.5264 1.8286 1.3444 1.1397 1.0852 2.5733 1.3802 2.0993 3.4565 3.5520 8.9644 9.0755 7.3681 8.8268 6.6686 7.2558 1.0299 1.0388 1.0973 1.1056 1.1032 1.0979 1.0860 1.0858 1.0910 1.0899 1.0946 1.0949 1.1006 1.1004
irintensity: 0.1864 0.0566 4.1792 2.1537 8.5628 1.0585 0.0330 0.6772 0.2341 1.0292 0.3872 1.5990 4.2266 0.1309 2.3665 0.4933 0.6314 5.3556 18.2913 5.7819 0.7468 0.9784 1.5295 1.7255 0.3037 0.0848 3.1323 10.7334 1.5596 4.9265 0.9840 14.1954 6.7334 7.4923 7.3344 3.1969 1.1475 4.3312 46.3854 15.2070 65.9345 6.0396 38.2229 0.4648 4.4860 1.2594 0.1808 29.7561 36.8091 33.3306 3.5206 48.6384 4.1706 18.9011 0.0872 10.4137 6.3963 2.8029 9.6090 7.1518 1.9160 14.7512 0.7659 3.5759 22.4138 20.1713 204.4382 97.2689 1.5748 52.0844 4.6626 115.8113 13.4440 6.0773 1.7679 2.8933 73.0295 20.9059 4.1504 19.8524 12.5927 17.3688 14.4388 2.6360 54.3574 110.7639 86.3865 110.8020 162.9832 224.2120 14.6857 34.4554 9.2569 19.6351 42.5530 7.1634 5.3627 22.3552 25.7060 4.0226 3.4717 0.4780 12.3153 3.1887 1.8099 10.6645 32.8327 13.4957
temp: 298.150 k
press: 1.00000 atm
elementType: 8 8 8 7 7 6 6 6 6 6 6 6 6 6 6 6 6 6 6 6 6 6 6 6 1 1 1 1 1 1 1 1 1 1 1 1 1 1
symmnumber: 1
zpe: 746407.2 jmol-1
zpe.correction: 0.284291 hartree
zpe.thermalcorrener: 0.304351 hartree
zpe.thermalcorrenthalpy: 0.305295 hartree
zpe.thermalcorrgfe: 0.235163 hartree
zpe.sumelectzpe: -1065.942644 hartree
zpe.sumelectthermal: -1065.922585 hartree
zpe.sumelectthermalent: -1065.921640 hartree
zpe.sumelectthermalfe: -1065.991773 hartree
dipole: 1.8191 -3.5317 0.1718
dipole: 3.9764
quadrupole: -116.8741 -150.3268 -131.0539
quadrupole: 13.1529 -5.7591 3.9174
quadrupole: 15.8775 -17.5752 1.6977 13.1529 -5.7591 3.9174
hfenergy: -1066.2269357 hartree
pointgroup: C01 [X(C19H14N2O3)]
dipole: -0.7457177 -1.3502356 0.2611776 debye
polarizability: 329.7151938|6.1505869|228.364756|-2.131505|-25.1753442|151.175898 unknown
InChI: InChI=1S/C19H14N2O3/c1-11-20-16-17(21(11)14-9-5-6-10-15(14)24-2)19(23)13-8-4-3-7-12(13)18(16)22/h3-10H,1-2H3
charge 0 multiplicity 1
38 atoms
O  0.142825 -2.13104 0.311722
O  3.117246 2.550347 -0.271198
O  -3.026226 -0.064845 -2.07548
N  -1.116765 0.644749 0.076165
N  0.092863 2.5531 -0.256655
C  0.234851 0.27539 0.120258
C  0.957872 1.47163 -0.085055
C  -1.155143 2.035858 -0.15357
C  0.826216 -1.05678 0.24146
C  2.33017 -1.055659 0.248399
C  -2.279389 -0.182576 0.309738
C  3.088804 0.146114 0.088078
C  2.43429 1.495288 -0.106796
C  -3.192595 -0.470826 -0.741753
C  -2.427393 2.811301 -0.258262
C  3.001001 -2.290555 0.414838
C  4.501785 0.082498 0.09976
C  -2.547968 -0.630291 1.623497
C  4.41074 -2.34223 0.426655
C  5.162853 -1.152673 0.269418
C  -4.389274 -1.166111 -0.445204
C  -3.72967 -1.341481 1.907708
C  -4.658743 -1.595265 0.869026
C  -1.701659 -0.250942 -2.714609
H  -3.055066 2.684633 0.642471
H  -2.177667 3.876043 -0.374685
H  -3.028935 2.484166 -1.126329
H  2.395249 -3.195004 0.532124
H  5.05848 1.01651 -0.027906
H  -1.824218 -0.40767 2.414483
H  4.922509 -3.301585 0.55726
H  6.257319 -1.190662 0.278038
H  -5.08001 -1.369032 -1.269076
H  -3.927652 -1.688024 2.926595
H  -5.585132 -2.139737 1.080529
H  -1.919767 -0.388254 -3.784829
H  -1.194782 -1.146921 -2.313649
H  -1.064918 0.640839 -2.579866
