program: Gaussian 09
title: 000284869
version: EM64L-G09RevD.01
frameworkgroup: C1[X(C10H18O3)]
method: RPBEPBE
basis: SDD
operation: Freq
keyword: #pfreq=noraman
keyword: PBEPBE/SDD
title: #p freq=noraman PBEPBE/SDD
converged: YES YES NO NO
title: Mulliken charges:
elementType: O O O C C C C C C C C C C H H H H H H H H H H H H H H H H H H
charge: -0.268181 -0.210773 -0.244020 -0.355589 -0.370813 -0.378998 -0.497495 -0.511021 0.219324 0.245117 -0.770948 -0.263803 -0.663082 0.187235 0.186322 0.212812 0.226346 0.209257 0.229629 0.233540 0.228356 0.236871 0.245253 0.256009 0.240130 0.230766 0.233475 0.221940 0.215961 0.226239 0.250142
chargesum: 0.00000
title: Mulliken charges with hydrogens summed into heavy atoms:
elementType: O O O C C C C C C C C C C
charge: -0.268181 -0.210773 -0.244020 0.017968 0.068346 0.059888 -0.035600 -0.028898 0.219324 0.245117 -0.044044 0.191612 0.029259
polarizability: 1.55224169e+02 3.02543023e+00 1.07069635e+02 -4.05932306e+00 3.14775933e+00 9.12418931e+01
1716.lowfreq: -18.4736 -4.0750 -0.0007 -0.0003 0.0001 7.8354 11.8314 22.9680 33.9933
frequency: 2.8304 22.5379 33.3056 48.5461 58.6675 71.6544 85.6022 101.4263 116.6434 131.6254 148.9960 187.8597 206.9156 256.6497 312.5823 362.0196 386.6437 424.9811 459.0860 474.9856 570.8510 586.6011 662.0509 714.2283 737.4635 783.5647 800.0803 814.4357 824.5682 892.2275 901.1462 943.3565 977.7695 1007.1181 1029.2893 1049.3754 1080.2137 1087.8109 1092.4172 1098.0749 1122.1561 1143.7162 1156.8527 1167.3011 1216.8832 1232.7851 1263.4349 1278.4744 1283.6286 1287.8517 1294.6417 1331.0854 1353.9344 1359.8458 1364.8181 1368.2269 1389.7792 1430.0158 1441.8355 1443.2952 1455.7895 1457.5208 1462.5181 1462.8084 1470.0905 1484.2759 1484.7697 1636.5716 1641.7503 2947.1381 2950.2183 2975.7144 2979.6997 2988.3315 2992.0733 2994.1328 2994.6364 2998.8641 3027.9128 3040.9861 3055.8886 3066.4307 3068.5464 3087.1359 3091.7078 3117.6357 3118.6743
redmass: 3.6612 3.6043 2.9699 4.2494 2.2062 2.4559 1.3017 2.6656 1.9756 2.4696 3.0289 5.3813 1.3265 2.6118 2.9375 3.6299 3.8893 2.9680 2.1918 2.8084 3.5476 3.5264 3.9394 1.1093 1.2074 2.2431 1.4225 1.6973 2.8365 3.6934 1.3772 2.0457 1.3080 2.8378 3.6740 3.2049 2.0129 3.9445 2.0468 2.0226 1.9233 1.8478 1.6869 2.0689 1.4017 1.4231 1.2289 1.1192 1.1443 1.2074 1.2204 1.5600 1.3611 1.6415 1.6536 1.2482 1.2324 1.0931 1.0865 1.0658 1.0578 1.0893 1.0476 1.0669 1.0883 1.0945 1.0542 7.8293 9.0190 1.0601 1.0611 1.0654 1.0383 1.0720 1.0361 1.0670 1.0818 1.0939 1.0593 1.0972 1.1015 1.0950 1.1005 1.0975 1.1033 1.1059 1.1005
irintensity: 0.6338 3.7041 0.2142 0.6237 0.5858 0.6259 0.3396 0.6627 0.9543 2.8758 5.0709 0.7388 6.7990 3.8060 11.7525 7.5488 4.7649 2.5880 0.3016 2.8136 2.7110 6.6894 5.6845 11.1184 3.8303 9.1200 1.9344 1.5241 2.0429 9.1338 3.5956 13.7933 3.8854 19.4583 69.8647 0.5451 24.3817 15.6127 62.3553 3.2026 85.4329 146.4892 31.5241 12.6917 7.6058 121.0110 1.8408 4.0875 0.9733 1.7994 2.6738 83.9085 4.4020 3.2956 13.6465 57.1763 22.7064 21.9693 21.5094 19.6275 17.6244 12.9059 13.4685 0.3639 1.3989 19.0878 16.6678 89.3767 166.7664 9.5752 35.9579 5.3861 4.7233 2.9200 18.2231 56.0451 22.4682 3.3181 33.2911 0.5441 20.5384 11.3825 79.3810 37.7177 1.0604 34.7738 14.7292
temp: 298.150 k
press: 1.00000 atm
elementType: 8 8 8 6 6 6 6 6 6 6 6 6 6 1 1 1 1 1 1 1 1 1 1 1 1 1 1 1 1 1 1
symmnumber: 1
zpe: 691014.4 jmol-1
zpe.correction: 0.263193 hartree
zpe.thermalcorrener: 0.279834 hartree
zpe.thermalcorrenthalpy: 0.280778 hartree
zpe.thermalcorrgfe: 0.213125 hartree
zpe.sumelectzpe: -616.488479 hartree
zpe.sumelectthermal: -616.471838 hartree
zpe.sumelectthermalent: -616.470894 hartree
zpe.sumelectthermalfe: -616.538548 hartree
dipole: 0.4809 -4.0232 -1.0052
dipole: 4.1747
quadrupole: -65.5212 -86.3080 -80.3903
quadrupole: 13.7568 -4.0115 -2.9408
quadrupole: 11.8853 -8.9015 -2.9838 13.7568 -4.0115 -2.9408
hfenergy: -616.7516725 hartree
pointgroup: C01 [X(C10H18O3)]
dipole: -0.1598632 -1.3653798 -0.8987808 debye
polarizability: 155.6086891|-0.5672638|101.7343876|-1.2446315|8.1823008|96.1926206 unknown
InChI: InChI=1S/C10H18O3/c1-3-13-10(12)8-6-4-5-7-9(2)11/h3-8H2,1-2H3
charge 0 multiplicity 1
31 atoms
O  -3.976923 -0.777115 -0.580741
O  4.623268 0.743003 1.579716
O  -2.994302 1.33185 -0.386498
C  0.963077 -0.678315 -0.382988
C  2.178833 0.014475 0.270432
C  -0.366808 0.043181 -0.073902
C  3.508179 -0.68873 -0.060687
C  -1.580777 -0.679539 -0.694467
C  4.731285 -0.09366 0.644322
C  -2.88019 0.0922 -0.527756
C  6.096658 -0.561912 0.147208
C  -5.33232 -0.152381 -0.463046
C  -5.736631 -0.01207 1.00726
H  0.905644 -1.730379 -0.031513
H  1.107094 -0.724719 -1.483541
H  2.231961 1.07018 -0.059813
H  2.052728 0.04902 1.368935
H  -0.50264 0.117152 1.023089
H  -0.332594 1.082272 -0.451455
H  3.456525 -1.76197 0.228119
H  3.698973 -0.694181 -1.154304
H  -1.417301 -0.815126 -1.78409
H  -1.713413 -1.693154 -0.275665
H  6.871015 -0.356279 0.902948
H  6.357039 -0.00741 -0.776126
H  6.090572 -1.636633 -0.109529
H  -5.312698 0.829375 -0.968317
H  -5.987891 -0.850155 -1.00846
H  -6.773071 0.367789 1.075681
H  -5.691522 -0.987075 1.522637
H  -5.07467 0.699707 1.528253
