program: Gaussian 09
title: 000284861
version: EM64L-G09RevD.01
frameworkgroup: C1[X(C7H6NO7P)]
method: RPBEPBE
basis: SDD
operation: Freq
keyword: #p
keyword: freq=noraman
keyword: PBEPBE/SDD
title: #p freq=noraman PBEPBE/SDD
converged: NO YES NO YES
title: Mulliken charges:
elementType: P O O O O O O O N C C C C C C C H H H H H H
charge: 1.243738 -0.661716 -0.661715 -0.595562 -0.431634 -0.226787 -0.184904 -0.186307 0.022966 -0.145263 -0.394114 -0.326064 0.304520 0.422100 -0.477499 0.119767 0.325542 0.327612 0.330344 0.398375 0.398375 0.398228
chargesum: 0.00000
title: Mulliken charges with hydrogens summed into heavy atoms:
elementType: P O O O O O O O N C C C C C C C
charge: 1.243738 -0.263341 -0.263340 -0.595562 -0.033406 -0.226787 -0.184904 -0.186307 0.022966 -0.145263 -0.068573 0.001547 0.304520 0.422100 -0.147155 0.119767
polarizability: 1.70951148e+02 3.62165742e-01 1.63016182e+02 5.81194910e-03 4.75699570e-03 6.54880786e+01
1716.lowfreq: -50.4402 -3.9079 -3.0746 -0.0009 0.0003 0.0011 7.3486 17.6949 51.3295
frequency: -50.4253 17.5114 51.3248 55.0098 83.2378 86.4557 128.5552 161.1558 184.4403 193.2858 225.8735 273.3481 278.6643 318.1289 329.8389 339.3403 341.7050 412.7408 424.4453 448.3709 493.8639 525.8486 558.6592 602.4406 609.1905 666.0515 676.8256 705.9090 706.6576 734.1330 745.4318 826.0631 859.3781 946.0525 975.7459 981.3856 984.4183 990.5168 997.4272 1042.4447 1064.5181 1095.9060 1128.0481 1179.3539 1217.2372 1259.9463 1325.6138 1381.5320 1401.5067 1409.7735 1460.0504 1587.5061 1610.8186 1651.2826 3165.6892 3178.6641 3184.4259 3535.8478 3595.9335 3599.7604
redmass: 1.5452 13.9483 13.8061 12.1452 8.7931 5.4518 10.7631 4.5157 4.4175 12.3068 8.3887 6.0845 2.7785 1.7010 4.7188 4.0710 7.5950 6.4705 7.3028 4.1274 8.6920 4.7508 5.2438 4.8402 1.3301 12.3519 3.3834 11.4532 3.9047 9.5929 6.2937 8.1958 10.0108 1.5492 1.4342 1.1801 5.1716 1.4171 1.9106 3.1853 3.0353 1.5049 1.4423 3.7008 9.4310 1.2308 2.7668 11.6167 9.6054 3.2432 4.0273 7.0998 7.3760 9.4114 1.0932 1.0930 1.0937 1.0644 1.0661 1.0665
irintensity: 34.6792 1.9613 0.0306 0.6016 1.6583 1.2690 0.4184 6.6543 6.5599 1.7144 31.3703 5.6408 32.6156 112.8066 6.9532 76.9134 57.1050 85.0814 8.1367 10.8090 1.1912 4.9907 14.9838 67.6947 121.3028 103.0182 24.2710 46.4578 49.6609 290.0151 14.1768 29.5304 0.0520 20.7904 12.1418 26.4897 6.8760 15.3810 3.5197 274.2832 193.0488 8.5418 70.2157 127.3418 163.3208 0.5902 81.4271 91.9492 6.7708 15.2726 23.0845 17.2946 14.1859 244.7165 9.3356 13.2703 10.9947 64.4595 73.5002 68.9582
temp: 298.150 k
press: 1.00000 atm
elementType: 15 8 8 8 8 8 8 8 7 6 6 6 6 6 6 6 1 1 1 1 1 1
symmnumber: 1
zpe: 352989.8 jmol-1
zpe.correction: 0.134447 hartree
zpe.thermalcorrener: 0.149802 hartree
zpe.thermalcorrenthalpy: 0.150747 hartree
zpe.thermalcorrgfe: 0.089850 hartree
zpe.sumelectzpe: -1191.640896 hartree
zpe.sumelectthermal: -1191.625541 hartree
zpe.sumelectthermalent: -1191.624596 hartree
zpe.sumelectthermalfe: -1191.685493 hartree
dipole: 3.5688 -2.7279 0.0002
dipole: 4.4919
quadrupole: -97.0604 -108.1292 -95.4352
quadrupole: 17.0263 0.0018 -0.0013
quadrupole: 3.1478 -7.9209 4.7731 17.0263 0.0018 -0.0013
hfenergy: -1191.7753431 hartree
pointgroup: C01 [X(C7H6N1O7P1)]
dipole: -1.4083343 -1.0676254 -0.0000789 debye
dipolederiv: 2.3389028 -0.024119 0.0000318 -0.1811031 1.3560356 0.0000278 0.0000337 0.0000526 1.8878595 -0.7449457 0.1864148 0.1393998 0.2561628 -0.6656799 -0.1973921 0.274638 -0.1440632 -0.9686631 -0.7449513 0.1864044 -0.1393738 0.2561174 -0.6655655 0.1973899 -0.274614 0.1440473 -0.9687831 -0.8326685 -0.0854653 -0.0000072 0.018057 -0.6327149 0.0000104 -0.0000226 -0.0000093 -0.623971 -0.3999748 -0.3278477 0.0000076 -0.2227717 -1.2397267 0.0000165 -0.0000354 -0.0000761 -0.4134469 -1.0148233 0.0917623 -0.0001043 0.232005 -0.6792348 0.0000187 0.0000273 0.0000094 -0.3150674 -0.7720739 -0.0924092 -0.0000285 -0.1737493 -0.5508959 0.0000135 -0.0000038 0.0000185 -0.2107277 -0.5158194 0.0366034 -0.0000105 0.1037964 -0.7929448 0.0000354 -0.0000288 0.0000503 -0.2082411 1.132625 0.2371591 0.0000278 0.2656491 1.5275876 -0.0000701 0.000032 -0.0000756 0.1851741 -0.1536493 0.0182333 0.0000085 -0.1103376 -0.4536242 0.0000056 0.0000161 0.0000155 -0.2350143 0.031213 -0.072749 0.0000083 -0.1369688 0.0609992 -0.0000162 -0.0000034 0.0000092 -0.0417239 -0.0241908 0.133873 -0.0000114 0.0949638 0.0528498 0.0000009 -0.0000141 0.0000013 -0.0012833 -0.2931062 0.0761482 -0.0000101 0.1303708 -0.4118834 0.0000172 -0.0000381 0.0000445 0.0223823 -0.2020643 -0.085669 -0.0000073 -0.1627226 -0.3708415 0.0000221 -0.0000013 0.000015 0.0654077 -0.0825842 -0.0302986 0.0000034 0.0179611 0.2008059 -0.0000167 -0.0000222 -0.0000029 -0.0525214 1.3369842 -0.1210052 0.0001172 -0.2911116 1.8263911 -0.0000415 0.0000753 -0.0000073 0.2378777 0.1665439 -0.0527557 0.0000035 -0.0302934 0.117941 0.0000012 0.0000002 0.0000001 0.1506466 0.1515937 0.0184019 -0.0000018 0.0501436 0.1409635 0.0000043 -0.0000052 0.0000043 0.1532186 0.1182431 -0.0092178 -0.0000034 -0.0092333 0.1814426 -0.0000011 -0.0000033 -0.0000018 0.1690486 0.1748528 -0.1017436 -0.0059948 -0.0784129 0.3213331 -0.0286829 0.0037897 -0.0055272 0.3798115 0.1749054 -0.101772 0.005957 -0.078449 0.3212924 0.0286645 -0.0038159 0.0055038 0.3797986 0.1549877 0.1200521 -0.0000118 0.0499262 0.3554696 -0.0000073 -0.0000042 -0.0000085 0.4082178 unknown
polarizability: 170.9481293|-0.3938332|163.0192006|0.0057929|-0.0047802|65.4880786 unknown
InChI: InChI=1S/C7H6NO7P/c9-7(10)4-1-5(8(11)12)3-6(2-4)16(13,14)15/h1-3,9,13-14H
charge 0 multiplicity 1
22 atoms
P  -2.953652 -0.282582 -0.000099
O  -3.371813 0.692453 1.367426
O  -3.371679 0.692246 -1.367817
O  -3.551509 -1.758008 -0.000038
O  1.225959 -3.53575 0.000218
O  3.210906 -2.321972 0.000294
O  2.798356 2.668486 0.000017
O  0.738136 3.649537 -0.000143
N  1.511248 2.618612 -0.000012
C  -1.125366 -0.085598 0.000008
C  -0.339099 -1.255896 0.000139
C  -0.537603 1.195207 -0.000043
C  1.073606 -1.143855 0.000221
C  0.869504 1.272218 0.000038
C  1.688769 0.128809 0.000166
C  1.959777 -2.347035 0.000371
H  -0.806736 -2.245726 0.000181
H  -1.133482 2.111778 -0.000141
H  2.779064 0.219023 0.000226
H  -4.266773 0.51508 1.754241
H  -4.266506 0.514633 -1.754832
H  1.846892 -4.31266 0.00018
