program: Gaussian 09
title: 000284857
version: EM64L-G09RevD.01
frameworkgroup: C1[X(C11H23NO)]
method: RPBEPBE
basis: SDD
operation: Freq
keyword: #p
keyword: freq=noraman
keyword: PBEPBE/SDD
title: #p freq=noraman PBEPBE/SDD
converged: NO YES NO NO
title: Mulliken charges:
elementType: O N C C C C C C C C C C C H H H H H H H H H H H H H H H H H H H H H H H
charge: -0.437162 -0.136664 0.018698 -0.457148 -0.458199 -0.396479 -0.394712 -0.396255 -0.424185 -0.369738 -0.360536 -0.659472 -0.331094 0.178598 0.208564 0.209149 0.217142 0.204099 0.186782 0.211668 0.191023 0.192948 0.198894 0.205394 0.197475 0.198031 0.192601 0.191401 0.169654 0.253247 0.243747 0.195139 0.214045 0.231121 0.182638 0.329587
chargesum: 0.00000
title: Mulliken charges with hydrogens summed into heavy atoms:
elementType: O N C C C C C C C C C C C
charge: -0.107575 -0.136664 0.197295 -0.039434 -0.036958 0.001970 -0.010740 0.008033 -0.028679 0.014263 0.062365 -0.006541 0.082664
polarizability: 1.46083404e+02 1.41248083e+00 1.23037325e+02 -3.21896895e+00 1.16313692e+00 1.12708223e+02
1716.lowfreq: -17.2499 -7.8444 0.0004 0.0004 0.0011 6.9205 35.5450 55.6257 69.1869
frequency: 35.3719 55.5482 69.1751 84.0927 143.4467 184.9267 193.7255 209.9443 237.6871 244.5459 263.6386 290.9043 317.2528 337.5370 361.3796 366.8837 415.2446 434.3793 450.2001 486.7838 501.9567 614.3248 688.1345 756.1275 764.5214 795.9322 796.8928 828.8735 856.3145 868.3507 929.1634 954.2582 959.0438 979.8065 1000.8197 1004.3567 1031.2653 1051.1259 1055.6795 1088.2718 1097.8711 1105.5647 1114.1119 1125.2819 1129.8169 1137.1758 1188.2834 1202.9373 1213.8417 1230.5731 1243.2419 1257.6536 1264.5149 1277.9030 1286.9529 1291.7542 1307.7495 1326.8673 1337.9589 1341.3462 1343.2535 1347.9196 1351.3966 1363.3664 1368.2082 1371.9216 1381.4811 1436.7851 1456.4146 1460.7813 1462.3641 1465.5085 1470.5384 1471.7919 1472.8120 1480.0444 1484.7482 1498.6800 1511.0040 2789.1953 2822.3401 2861.7659 2950.9346 2961.7570 2963.6178 2968.0653 2969.2085 2979.0040 2981.5383 2999.1221 3007.0335 3014.7326 3022.2317 3024.7070 3034.4216 3041.9995 3042.8016 3049.1469 3091.3225 3092.6501 3108.1393 3556.1187
redmass: 4.0668 1.9887 3.1173 3.1923 2.7710 2.3116 2.1104 1.3529 2.2146 2.5817 2.8231 1.8828 1.2955 3.1773 2.2042 3.2173 2.2374 2.6779 1.8576 1.7192 2.3561 2.5290 2.1416 2.0515 1.6509 1.2883 2.0581 2.7052 1.7611 1.8014 2.0062 2.8752 2.5704 2.0198 2.1342 2.2185 1.8129 2.2794 2.3645 1.8756 1.4923 1.7285 1.2783 2.4391 2.0890 1.6735 1.4235 1.2456 1.5336 1.4089 1.6402 1.2913 1.1775 1.2368 1.1491 1.1493 1.2896 1.4231 1.4151 1.3592 1.3995 1.3041 1.3165 1.3968 1.3364 1.4096 1.3046 1.1586 1.0801 1.0847 1.0837 1.0772 1.0751 1.0623 1.0876 1.0795 1.0678 1.0790 1.0668 1.0802 1.0718 1.0580 1.0599 1.0632 1.0637 1.0636 1.0683 1.0651 1.0646 1.0660 1.0937 1.0992 1.0962 1.1000 1.1002 1.0859 1.0830 1.0963 1.0883 1.0980 1.0945 1.0660
irintensity: 0.3876 3.7220 1.9929 0.8095 0.8953 0.4670 0.2232 0.2663 0.6836 1.3359 0.9270 30.9096 113.8154 1.3009 27.3218 16.4827 1.3637 3.5886 1.9618 0.8065 2.0636 0.0090 3.3313 4.1928 4.5125 3.2157 7.6464 10.8238 8.0049 1.0706 13.8331 50.0722 73.5277 4.6859 1.2776 59.3593 1.0876 12.2078 7.7320 6.1141 1.8793 4.8065 3.0856 14.3868 1.0074 1.2486 4.4424 3.7054 2.1593 13.7835 7.5821 4.9000 1.6277 3.0931 3.9857 2.2946 22.8711 2.0987 8.7112 4.3398 9.1840 14.2669 3.7079 2.1012 0.5970 0.0049 5.2698 8.6133 3.7340 5.1273 10.9281 4.5764 6.5067 6.9921 2.7393 3.5807 22.4704 15.8417 20.6602 76.4873 129.0494 145.7723 30.2754 29.0434 16.2619 54.3683 32.7513 52.5072 25.7602 54.7127 70.2495 20.7818 49.4090 87.6696 60.3817 25.1372 35.2351 98.7355 26.7898 19.3722 31.6697 6.3293
temp: 298.150 k
press: 1.00000 atm
elementType: 8 7 6 6 6 6 6 6 6 6 6 6 6 1 1 1 1 1 1 1 1 1 1 1 1 1 1 1 1 1 1 1 1 1 1 1
symmnumber: 1
zpe: 859637.5 jmol-1
zpe.correction: 0.327419 hartree
zpe.thermalcorrener: 0.342132 hartree
zpe.thermalcorrenthalpy: 0.343076 hartree
zpe.thermalcorrgfe: 0.285921 hartree
zpe.sumelectzpe: -561.802983 hartree
zpe.sumelectthermal: -561.788269 hartree
zpe.sumelectthermalent: -561.787325 hartree
zpe.sumelectthermalfe: -561.844481 hartree
dipole: -0.5862 1.3598 -2.0687
dipole: 2.5441
quadrupole: -83.3991 -84.7128 -84.5863
quadrupole: 6.8344 -7.8193 2.3453
quadrupole: 0.8336 -0.4801 -0.3535 6.8344 -7.8193 2.3453
hfenergy: -562.1304014 hartree
pointgroup: C01 [X(C11H23N1O1)]
dipole: 0.2193472 -0.4399957 -0.8718483 debye
polarizability: 146.1697128|1.2388138|123.1856473|2.7785269|0.0044256|112.4735916 unknown
InChI: InChI=1S/C11H23NO/c1-12(9-10-13)11-7-5-3-2-4-6-8-11/h11,13H,2-10H2,1H3
charge 0 multiplicity 1
36 atoms
O  -4.355703 1.213995 1.034497
N  -1.295623 -0.580665 -0.345451
C  -0.043378 -0.137314 -1.050929
C  1.046573 -1.23967 -0.950244
C  0.42342 1.264682 -0.548462
C  1.437936 -1.727793 0.463577
C  1.88165 1.680258 -0.906837
C  2.157132 -0.702142 1.379814
C  2.933348 1.526632 0.225503
C  3.306905 0.097846 0.702334
C  -2.394519 0.414926 -0.279824
C  -1.801261 -1.879744 -0.848352
C  -3.257433 0.232504 0.988726
H  -0.25449 -0.026949 -2.151205
H  1.946964 -0.872513 -1.476318
H  0.714441 -2.116405 -1.540051
H  0.280668 1.31814 0.547632
H  -0.251314 2.024949 -0.985373
H  2.109109 -2.602527 0.334206
H  0.532703 -2.092707 0.986225
H  1.871784 2.753688 -1.183372
H  2.224336 1.146888 -1.81633
H  2.564265 -1.26322 2.244681
H  1.420097 0.00519 1.804691
H  2.575484 2.101222 1.105823
H  3.864564 2.028925 -0.110519
H  4.141298 0.208138 1.423897
H  3.719698 -0.485614 -0.146463
H  -3.057173 0.367304 -1.185719
H  -1.986223 1.435171 -0.243437
H  -1.116906 -2.702846 -0.585174
H  -1.944713 -1.886392 -1.958656
H  -2.775011 -2.104026 -0.3807
H  -2.652991 0.438489 1.885284
H  -3.653795 -0.801583 1.065396
H  -4.930544 1.084264 0.237729
