program: Gaussian 09
title: 000284858
version: EM64L-G09RevD.01
frameworkgroup: C1[X(C10H14BrO3P)]
method: RPBEPBE
basis: SDD
operation: Freq
keyword: #p
keyword: freq=noraman
keyword: PBEPBE/SDD
title: #p freq=noraman PBEPBE/SDD
converged: YES YES NO NO
title: Mulliken charges:
elementType: Br P O O O C C C C C C C C C C H H H H H H H H H H H H H H
charge: 0.058672 1.288885 -0.552602 -0.476312 -0.581766 -0.144488 -0.279050 -0.228566 -0.237309 -0.220108 -0.182887 -0.223192 -0.216771 -0.647940 -0.661570 0.303738 0.228569 0.220274 0.218292 0.222897 0.258819 0.241833 0.241446 0.209317 0.218869 0.264918 0.204680 0.231754 0.239600
chargesum: 0.00000
title: Mulliken charges with hydrogens summed into heavy atoms:
elementType: Br P O O O C C C C C C C C C C
charge: 0.058672 1.288885 -0.552602 -0.476312 -0.581766 -0.144488 -0.279050 0.075171 0.211534 0.221081 0.075932 0.018641 0.024675 0.045164 0.014463
polarizability: 1.75753051e+02 1.19268530e+00 1.64482905e+02 3.07917211e+00 2.31829336e+01 1.28168553e+02
1716.lowfreq: -4.0906 0.0012 0.0016 0.0017 6.0652 9.8908 24.3155 27.1088 36.6664
frequency: 23.7998 26.9849 36.4850 43.9965 63.7193 95.3507 96.1330 119.2423 143.5046 161.1287 200.5991 226.5005 229.5375 250.9078 255.6483 266.3468 318.9365 324.6934 369.9161 394.3848 424.7329 450.9206 485.4643 522.4691 603.8548 643.1146 671.7561 709.3051 715.1801 766.1293 801.5291 811.8752 863.0543 876.5533 879.8500 966.2636 997.4336 999.6502 1012.8786 1020.5120 1026.6411 1049.2174 1095.6365 1099.9888 1105.2232 1127.0084 1132.1270 1148.0907 1175.6709 1255.6469 1256.6511 1269.7289 1351.0761 1356.7129 1363.4061 1388.3426 1394.5228 1410.5713 1436.3606 1457.4756 1460.0640 1468.3976 1476.9096 1487.7711 1488.1691 1566.7366 1582.9614 2972.7775 2987.4371 2994.3854 3003.3592 3034.4697 3074.1778 3083.1237 3090.8872 3109.2489 3112.3037 3141.6361 3158.3129 3172.2434 3180.4055
redmass: 6.0288 2.2508 2.9471 2.9922 3.0222 6.4487 3.3458 4.3551 4.9437 5.6739 3.4209 2.9685 3.1901 1.6630 1.4355 4.4036 7.6325 5.1626 5.3069 5.0164 3.7967 4.0769 6.8974 4.3491 7.1509 6.9015 6.9069 6.8230 4.8863 1.2068 1.1176 1.0915 3.4803 3.5450 1.3505 1.3629 7.7256 1.3346 3.0115 3.0826 3.5577 6.2303 2.1624 2.3360 2.2021 1.7316 1.4314 1.5597 1.0598 1.2618 1.2411 1.1255 1.2427 1.2598 9.2561 1.2307 1.2426 2.0082 2.2079 1.0398 1.0400 1.0757 1.0545 1.0545 1.0770 6.0750 6.5144 1.0555 1.0363 1.0368 1.0611 1.1075 1.1040 1.0978 1.0981 1.1018 1.1030 1.0866 1.0914 1.0950 1.0993
irintensity: 0.5053 0.6900 1.3526 2.2669 0.6923 0.4995 0.6747 0.2777 4.4713 0.1876 17.0034 2.1708 1.9264 2.3427 3.2446 11.0286 10.9800 2.5645 1.0917 2.6912 10.4699 35.2901 52.3417 7.9746 71.3042 32.0997 110.9309 36.3499 16.8433 70.8416 5.0429 1.7796 160.5494 111.3369 3.7097 1.0634 36.6488 0.0585 166.6766 126.9273 18.4119 57.1352 14.9235 31.7983 10.2526 12.4013 3.2186 9.5591 2.5273 4.8434 7.0934 1.1762 16.3353 5.2629 0.7154 34.5812 25.3922 35.7457 32.5165 11.2010 12.9180 2.6637 6.4435 10.8050 8.8039 20.6789 9.1953 30.6245 24.1047 24.8562 35.3806 22.9202 9.9991 34.8605 26.8848 31.6859 23.2409 3.1933 8.8924 1.7751 17.9832
temp: 298.150 k
press: 1.00000 atm
elementType: 35 15 8 8 8 6 6 6 6 6 6 6 6 6 6 1 1 1 1 1 1 1 1 1 1 1 1 1 1
symmnumber: 1
zpe: 582678.4 jmol-1
zpe.correction: 0.221930 hartree
zpe.thermalcorrener: 0.239575 hartree
zpe.thermalcorrenthalpy: 0.240519 hartree
zpe.thermalcorrgfe: 0.173159 hartree
zpe.sumelectzpe: -968.649338 hartree
zpe.sumelectthermal: -968.631693 hartree
zpe.sumelectthermalent: -968.630749 hartree
zpe.sumelectthermalfe: -968.698109 hartree
dipole: 0.2343 2.7688 4.9175
dipole: 5.6483
quadrupole: -89.4262 -99.4612 -109.7292
quadrupole: 2.1773 -0.7419 -0.8541
quadrupole: 10.1127 0.0776 -10.1903 2.1773 -0.7419 -0.8541
hfenergy: -968.8712681 hartree
pointgroup: C01 [X(C10H14Br1O3P1)]
dipole: 0.5418173 0.6411257 2.0575578 debye
polarizability: 176.5621664|-1.9213192|155.663148|6.2055739|26.7698978|136.1791947 unknown
InChI: InChI=1S/C10H14BrO3P/c1-3-13-15(12,14-4-2)10-8-6-5-7-9(10)11/h5-8H,3-4H2,1-2H3
charge 0 multiplicity 1
29 atoms
Br 1.806273 -1.707406 -1.677535
P  -0.991061 -0.071805 -0.546668
O  -1.944851 0.9735 0.473548
O  -1.335154 -1.669447 0.058554
O  -1.333031 0.014475 -2.095659
C  0.706099 0.408982 0.065152
C  1.883371 -0.227431 -0.398891
C  0.825272 1.4708 0.99863
C  -3.350595 1.252325 0.046225
C  -1.08683 -1.967611 1.497673
C  3.156523 0.183974 0.050967
C  2.093686 1.886285 1.454719
C  3.258602 1.243897 0.97911
C  -3.412065 2.464303 -0.886582
C  -1.569178 -3.398168 1.722879
H  -0.087584 1.957647 1.351812
H  -3.774604 0.352867 -0.439608
H  -3.879098 1.431871 0.997884
H  -0.003575 -1.86857 1.710691
H  -1.642446 -1.241233 2.122292
H  4.053795 -0.31809 -0.321865
H  2.169518 2.708258 2.173598
H  4.248122 1.562068 1.32413
H  -4.467028 2.708796 -1.11467
H  -2.94743 3.346441 -0.412468
H  -2.890445 2.246252 -1.833417
H  -1.399288 -3.694521 2.774882
H  -2.646249 -3.485227 1.501298
H  -1.02205 -4.096227 1.067118
