program: Gaussian 09
title: 000284874
version: EM64L-G09RevD.01
frameworkgroup: C1[X(C18H17NO3)]
method: RPBEPBE
basis: SDD
operation: Freq
keyword: #p
keyword: freq=noraman
keyword: PBEPBE/SDD
title: #p freq=noraman PBEPBE/SDD
converged: YES YES NO NO
title: Mulliken charges:
elementType: O O O N C C C C C C C C C C C C C C C C C C H H H H H H H H H H H H H H H H H
charge: -0.257893 -0.246258 -0.258328 -0.485803 0.369391 0.450968 -0.430991 0.260734 0.172764 -0.405188 -0.387760 0.178711 -0.345924 -0.371520 -0.246405 -0.244757 -0.238684 -0.224201 -0.232215 -0.226244 -0.252292 -0.667586 0.203857 0.307110 0.220492 0.310829 0.273882 0.231618 0.227282 0.228620 0.229883 0.234295 0.231283 0.224802 0.240566 0.234053 0.215861 0.250418 0.224630
chargesum: 0.00000
title: Mulliken charges with hydrogens summed into heavy atoms:
elementType: O O O N C C C C C C C C C C C C C C C C C C
charge: -0.257893 -0.246258 -0.258328 -0.178694 0.369391 0.450968 -0.227134 0.260734 0.172764 -0.184695 -0.076931 0.178711 -0.072041 -0.139902 -0.019123 -0.016137 -0.008801 0.010094 -0.000933 0.007809 0.213076 0.023323
polarizability: 3.85564389e+02 1.98570571e+01 1.94630550e+02 -1.41798707e+00 -3.09060650e+01 1.44934647e+02
1716.lowfreq: -3.4105 -2.5711 0.0007 0.0008 0.0010 3.0637 19.7407 29.3905 35.5887
frequency: 19.5914 29.3714 35.5328 39.5203 49.2826 67.4034 80.8891 107.7061 128.9777 136.9519 147.6313 184.3374 196.7691 230.9757 243.1169 266.3230 306.4787 313.9754 334.4711 400.1900 403.6979 407.7406 409.4680 465.2488 497.6671 506.8360 551.9098 571.4346 600.4611 614.3165 622.5741 640.5844 666.8311 690.7127 701.1692 705.0563 738.3208 755.2613 771.3076 790.6915 813.4040 824.2139 855.7359 856.9049 862.8435 894.9800 906.0583 937.4111 944.2493 984.1722 985.2718 988.0349 989.9617 1005.4506 1011.9396 1014.0093 1023.6074 1032.2091 1065.8943 1083.2169 1095.1263 1095.2452 1119.8102 1156.8333 1173.8828 1174.3316 1188.6723 1204.2328 1224.4005 1242.3986 1256.1428 1278.5796 1317.0911 1337.0988 1354.0231 1370.3380 1384.5694 1389.4355 1394.3837 1432.4660 1439.5170 1456.8674 1462.2619 1468.3474 1481.5486 1485.4821 1489.8367 1574.1752 1576.3886 1603.5257 1605.2955 1610.0787 1620.2339 1625.5724 2991.9554 3033.6676 3057.4990 3086.0850 3095.0415 3112.2647 3120.8341 3121.3206 3128.4996 3133.3491 3142.4242 3146.2046 3158.4627 3160.7309 3170.2744 3175.8269 3534.5142
redmass: 4.2593 5.1537 3.9738 4.5125 3.5360 4.0358 4.2400 4.9512 5.7160 5.2796 3.9963 4.9832 1.8825 2.3250 5.5465 4.3430 7.0257 3.3744 4.0865 3.5990 2.9692 3.5917 3.8924 5.3767 4.3818 2.9580 5.8173 1.3739 3.8386 6.0702 5.8520 6.1740 7.2409 5.1610 1.7869 1.5704 5.8712 2.6978 1.7676 2.3841 1.6459 3.8243 1.3815 1.2763 2.6843 4.5187 1.6050 1.4415 1.5135 1.5335 1.6115 3.5588 4.2297 1.3424 1.5382 2.2967 2.5056 2.1669 2.9779 1.7134 2.0412 2.0366 3.7421 1.6773 1.0668 1.0574 1.1154 1.1359 2.2071 4.1742 2.0638 1.1152 1.3296 1.5465 1.2919 2.7188 9.0518 1.2396 2.8589 2.2178 2.2723 1.1033 1.0495 1.7728 2.1745 1.0629 2.2453 6.2483 5.6013 6.8379 6.7439 6.0338 7.7009 7.1424 1.0362 1.0592 1.0863 1.0973 1.1029 1.0876 1.1065 1.0870 1.0870 1.0873 1.0933 1.0920 1.0959 1.0990 1.1009 1.0967 1.0767
irintensity: 0.2703 0.4990 0.2883 0.8564 0.1098 4.6594 0.6115 0.6031 5.2426 1.5322 1.9333 1.1337 1.8110 5.6013 0.5065 2.5241 7.5219 6.3753 9.2214 1.9175 0.8242 0.6514 1.1030 24.2331 2.9403 4.4335 11.5153 61.7933 17.7513 0.7760 2.1462 7.0613 10.2000 10.0001 39.1182 122.0946 27.8219 12.7063 24.2697 19.9390 4.3194 3.4119 1.8239 2.9629 8.3950 24.2486 9.6371 2.1804 16.3825 2.4815 0.5160 0.2362 0.2053 1.7038 17.0516 29.4717 23.5885 6.3426 106.5292 34.5474 1.7957 25.7787 226.9343 29.8313 2.4287 0.8660 13.3757 1.6242 64.1976 25.4557 226.6383 4.3738 2.2700 69.1969 31.7986 178.0845 2.7580 21.9609 211.5052 9.4759 43.9230 29.8426 19.1814 134.6359 25.3310 19.7662 79.9613 37.1071 43.5792 7.7157 92.9431 3.1356 66.5842 22.0917 22.8489 23.0185 28.9257 35.5699 2.0007 10.7441 30.1652 9.9494 0.4320 1.8704 34.3783 21.0563 16.8711 28.9905 25.2521 30.5895 7.3289
temp: 298.150 k
press: 1.00000 atm
elementType: 8 8 8 7 6 6 6 6 6 6 6 6 6 6 6 6 6 6 6 6 6 6 1 1 1 1 1 1 1 1 1 1 1 1 1 1 1 1 1
symmnumber: 1
zpe: 804892.4 jmol-1
zpe.correction: 0.306567 hartree
zpe.thermalcorrener: 0.326811 hartree
zpe.thermalcorrenthalpy: 0.327756 hartree
zpe.thermalcorrgfe: 0.254704 hartree
zpe.sumelectzpe: -974.977314 hartree
zpe.sumelectthermal: -974.957070 hartree
zpe.sumelectthermalent: -974.956125 hartree
zpe.sumelectthermalfe: -975.029177 hartree
dipole: 1.6083 -2.5055 3.5679
dipole: 4.6470
quadrupole: -105.0515 -114.8355 -132.0325
quadrupole: -3.6155 0.2051 -1.2818
quadrupole: 12.2550 2.4710 -14.7260 -3.6155 0.2051 -1.2818
hfenergy: -975.2838809 hartree
pointgroup: C01 [X(C18H17N1O3)]
dipole: 0.7244116 -0.56048 1.5822838 debye
polarizability: 381.616289|31.3753354|180.0678203|-10.9012484|-40.4577788|163.4454766 unknown
InChI: InChI=1S/C18H17NO3/c1-2-22-18(21)16(13-14-9-5-3-6-10-14)19-17(20)15-11-7-4-8-12-15/h3-13,19H,2H2,1H3
charge 0 multiplicity 1
39 atoms
O  -0.184742 2.125268 0.138171
O  1.584817 0.734985 -1.675651
O  -1.789695 1.446988 -1.411736
N  0.805309 -0.443929 0.179438
C  -0.582572 -0.208495 -0.047225
C  -2.944009 -1.287779 0.340579
C  -1.476177 -1.20058 0.293087
C  3.228516 -0.22959 -0.161291
C  1.830385 0.073174 -0.621838
C  -3.487088 -2.336888 1.146977
C  -3.857633 -0.449756 -0.368463
C  -0.926438 1.166547 -0.5456
C  4.258026 -0.219352 -1.137398
C  3.557691 -0.491351 1.195502
C  -4.876981 -2.523876 1.273129
C  -5.24854 -0.642572 -0.239206
C  -5.768922 -1.67061 0.581858
C  5.590803 -0.493973 -0.769337
C  4.89416 -0.76174 1.563016
C  5.911973 -0.771573 0.581122
C  -0.319616 3.531762 -0.351199
C  -1.494905 4.239012 0.329532
H  -0.99048 -2.114939 0.674256
H  1.055917 -1.127639 0.896388
H  -2.802433 -3.003273 1.687654
H  -3.470663 0.321543 -1.038206
H  3.98815 0.011395 -2.173188
H  2.789433 -0.436608 1.976443
H  -5.264237 -3.332193 1.90329
H  -5.932217 0.007032 -0.797423
H  -6.851611 -1.813948 0.670727
H  6.378723 -0.49068 -1.530227
H  5.143264 -0.951238 2.612829
H  0.648154 3.987651 -0.087897
H  -0.440079 3.504576 -1.447888
H  6.948184 -0.982575 0.867713
H  -1.515703 5.301563 0.022816
H  -2.452764 3.776834 0.038682
H  -1.396402 4.199329 1.428266
