program: Gaussian 09
title: 000284877
version: EM64L-G09RevD.01
frameworkgroup: C1[X(C16H14N2O3)]
method: RPBEPBE
basis: SDD
operation: Freq
keyword: #p
keyword: freq=noraman
keyword: PBEPBE/SDD
title: #p freq=noraman PBEPBE/SDD
converged: YES YES NO NO
title: Mulliken charges:
elementType: O O O N N C C C C C C C C C C C C C C C C H H H H H H H H H H H H H H
charge: -0.227019 -0.243520 -0.218727 -0.494440 0.001638 0.480087 0.253474 0.433834 -0.476215 0.173265 -0.359576 -0.339440 -0.286916 -0.232971 -0.222821 0.079530 -0.485822 -0.223578 -0.201023 -0.350130 -0.503303 0.213939 0.317072 0.223749 0.273569 0.261896 0.233666 0.236237 0.241964 0.236299 0.231451 0.243641 0.233809 0.261080 0.235301
chargesum: 0.00000
title: Mulliken charges with hydrogens summed into heavy atoms:
elementType: O O O N N C C C C C C C C C C C C C C C C
charge: -0.227019 -0.243520 -0.218727 -0.177369 0.001638 0.480087 0.253474 0.433834 -0.262276 0.173265 -0.135827 -0.065871 -0.025020 0.000694 0.013416 0.079530 -0.243859 0.012721 0.030427 -0.106489 0.226888
polarizability: 3.75572834e+02 -1.22683331e+01 1.85968761e+02 3.47019724e+00 -2.07426244e+00 1.15240153e+02
1716.lowfreq: -6.5968 -5.6539 -0.0007 -0.0006 -0.0005 0.8713 16.5130 29.5792 35.8544
frequency: 16.4485 29.5625 35.8521 45.5057 51.7715 70.2222 102.8810 106.2726 128.7894 145.1515 172.0675 190.3466 195.9944 244.0593 246.9734 289.7233 306.7578 309.8905 395.2227 401.1446 410.2556 446.7661 495.9721 508.4422 555.0045 601.9000 612.0174 617.9139 640.1403 646.6070 661.4551 686.7581 702.5439 715.0049 743.9358 779.8243 789.7185 807.4490 835.0747 855.0011 863.6544 893.7113 915.5774 929.3068 937.7668 939.4931 984.1909 984.5902 989.6830 1001.0350 1006.8396 1023.5224 1033.1851 1070.6216 1091.0206 1110.3929 1119.3279 1141.8634 1155.4142 1175.4427 1191.0819 1199.4055 1227.3584 1251.1937 1268.4446 1316.3534 1319.1751 1343.1898 1368.6899 1385.8728 1402.6189 1419.9459 1434.3920 1451.7172 1458.2198 1460.5312 1473.8205 1489.9601 1544.4099 1573.8915 1581.7120 1604.7893 1609.5300 1613.6952 1641.7575 3003.9249 3071.7184 3107.3843 3107.8071 3119.9534 3134.0859 3135.3027 3148.0522 3151.9801 3154.2449 3160.2685 3170.9552 3171.9599 3533.9393
redmass: 4.9668 4.5090 5.4576 5.1395 4.0936 3.8311 1.2140 4.9204 4.4356 7.5734 4.8915 5.3727 6.4509 4.1429 5.6331 6.2699 4.2881 5.1929 3.1701 2.8280 5.4663 5.6745 4.5755 3.7667 5.2992 6.8250 3.6763 2.7064 2.9277 3.5091 6.2350 5.0576 1.5694 1.8839 7.4856 5.5745 2.3257 1.7983 4.2747 1.2591 1.5951 5.5043 1.4116 3.9003 1.6039 1.7124 1.4942 1.4008 4.5915 3.8328 1.3452 2.5714 2.8089 2.6122 1.8409 1.2855 1.9226 2.5691 1.8868 1.0584 1.1153 1.3763 1.6617 2.6502 2.5929 4.2664 1.5997 1.4056 2.1627 8.9009 2.0673 1.2391 2.2047 1.0492 1.8326 1.0532 2.1967 2.2807 4.9036 6.1816 5.6820 6.9023 6.4041 7.9528 8.1714 1.0297 1.0881 1.0913 1.1039 1.0877 1.0878 1.0870 1.0918 1.0923 1.1048 1.0958 1.0997 1.1010 1.0767
irintensity: 3.8388 0.7857 0.8110 0.7211 4.0273 2.6328 1.3374 0.5581 1.4609 3.7321 4.6031 0.0775 0.5604 7.9579 1.3696 16.8331 8.4352 2.3228 1.8448 0.2283 1.3849 27.6198 9.0707 3.5825 0.1560 5.5057 20.5142 27.0686 6.7184 14.4317 8.9186 15.4426 102.5020 36.7100 20.9726 13.1386 19.8454 9.3762 15.6565 2.5695 36.8177 15.6949 10.2496 9.0955 6.4763 5.4836 2.5955 0.1699 0.9719 9.1853 1.6820 15.0444 1.0806 45.7051 5.3197 1.2566 28.4052 115.9749 106.5680 1.6098 18.4791 14.7389 20.7752 204.1812 10.6550 8.7313 5.3186 40.3197 301.8697 7.7223 53.1813 66.6519 5.4746 7.0448 129.0029 9.2864 51.6361 167.7585 22.3773 85.2710 4.3781 75.2397 76.3662 123.8524 81.7773 29.7501 27.0520 20.0493 22.0288 12.1347 2.9277 0.9303 18.0118 20.8576 12.9983 15.1348 20.2308 23.5825 11.9201
temp: 298.150 k
press: 1.00000 atm
elementType: 8 8 8 7 7 6 6 6 6 6 6 6 6 6 6 6 6 6 6 6 6 1 1 1 1 1 1 1 1 1 1 1 1 1 1
symmnumber: 1
zpe: 698418.1 jmol-1
zpe.correction: 0.266013 hartree
zpe.thermalcorrener: 0.285151 hartree
zpe.thermalcorrenthalpy: 0.286096 hartree
zpe.thermalcorrgfe: 0.215279 hartree
zpe.sumelectzpe: -951.782534 hartree
zpe.sumelectthermal: -951.763396 hartree
zpe.sumelectthermalent: -951.762452 hartree
zpe.sumelectthermalfe: -951.833268 hartree
dipole: -3.0672 -1.1255 0.0732
dipole: 3.2680
quadrupole: -105.7373 -113.8045 -129.2583
quadrupole: 22.8085 8.0911 -6.7627
quadrupole: 10.5294 2.4622 -12.9916 22.8085 8.0911 -6.7627
hfenergy: -952.0485474 hartree
pointgroup: C01 [X(C16H14N2O3)]
dipole: 1.2145324 0.3280435 0.2653814 debye
polarizability: 374.7087854|-5.1937558|155.1720432|-17.9933312|35.2629646|146.9009197 unknown
InChI: InChI=1S/C16H14N2O3/c1-21-16(20)14(10-12-6-5-9-17-11-12)18-15(19)13-7-3-2-4-8-13/h2-11,18H,1H3
charge 0 multiplicity 1
35 atoms
O  -1.380984 -1.127861 -1.865324
O  1.66751 -1.040483 -1.528064
O  -0.614144 -2.359552 -0.035137
N  0.884367 0.378836 0.14389
N  -5.059224 1.975133 0.74356
C  -0.489928 0.088853 -0.016646
C  3.31317 0.152004 -0.188374
C  -2.898982 0.796747 0.508129
C  -1.442807 0.962222 0.444297
C  1.917673 -0.230429 -0.584351
C  3.650143 0.648155 1.099641
C  4.337172 -0.028573 -1.153984
C  -3.593502 -0.448431 0.473372
C  4.988482 0.977285 1.405798
C  5.671662 0.305203 -0.847758
C  -0.794905 -1.266324 -0.619486
C  -3.701191 1.969022 0.662316
C  6.000528 0.813916 0.43151
C  -4.999822 -0.458558 0.553639
C  -5.695256 0.766808 0.680891
C  -1.629891 -2.398743 -2.588468
H  -1.07852 1.930515 0.822604
H  1.128067 1.138567 0.782878
H  2.890903 0.734099 1.886956
H  4.061803 -0.436975 -2.131712
H  -3.047061 -1.394486 0.422512
H  5.243432 1.347172 2.404694
H  6.454809 0.167928 -1.600948
H  -3.219706 2.954579 0.716636
H  7.038244 1.070426 0.671221
H  -5.553946 -1.402438 0.535024
H  -6.788401 0.794969 0.748472
H  -2.331208 -3.035488 -2.022479
H  -0.674394 -2.931543 -2.725072
H  -2.059191 -2.091351 -3.551638
