program: Gaussian 09
title: 000284843
version: EM64L-G09RevD.01
frameworkgroup: C1[X(C10H12N2O3)]
method: RPBEPBE
basis: SDD
operation: Freq
keyword: #p
keyword: freq=noraman
keyword: PBEPBE/SDD
title: #p freq=noraman PBEPBE/SDD
converged: YES YES NO NO
title: Mulliken charges:
elementType: O O O N N C C C C C C C C C C H H H H H H H H H H H H
charge: -0.264432 -0.199118 -0.218114 -0.438147 -0.649392 0.380489 -0.656090 -0.357360 -0.378449 0.313981 -0.351329 -0.350185 0.244506 0.271531 -0.537763 0.254818 0.254627 0.246196 0.241648 0.256040 0.245945 0.333696 0.221286 0.249629 0.225143 0.314259 0.346587
chargesum: 0.00000
title: Mulliken charges with hydrogens summed into heavy atoms:
elementType: O O O N N C C C C C C C C C C
charge: -0.264432 -0.199118 -0.218114 -0.104451 0.011454 0.380489 -0.146645 -0.111165 -0.136801 0.313981 -0.095289 -0.104241 0.244506 0.271531 0.158294
polarizability: 1.77419987e+02 -2.58526512e+01 1.16511659e+02 -3.12194880e+00 1.54341455e+00 1.06099363e+02
1716.lowfreq: -11.0303 -0.0007 -0.0006 0.0001 0.9829 3.4936 11.2694 24.9438 32.8933
frequency: 9.0714 24.9059 32.8815 42.3085 93.3980 122.2532 143.2851 185.3249 212.8056 240.3914 296.3491 319.2527 341.4249 383.8292 413.4023 418.5723 457.3567 477.9038 523.4201 537.8865 555.4075 562.1901 632.0873 645.6914 662.0920 717.9561 723.7938 749.2043 816.1010 826.5196 844.5148 900.3262 916.3565 939.4776 963.1017 968.4809 985.3670 1001.6989 1056.3042 1109.2528 1111.6737 1156.8342 1169.7063 1176.8642 1182.9989 1215.7906 1234.3201 1283.4855 1302.1302 1307.1267 1377.4550 1417.4679 1436.6555 1439.7609 1450.8417 1468.3672 1473.1178 1501.6192 1577.7735 1608.4675 1621.5351 1643.9581 1699.1199 2962.9181 3009.0815 3052.1210 3063.5681 3125.5784 3127.7862 3129.5137 3163.5792 3168.3335 3475.2713 3530.3827 3686.6265
redmass: 5.4927 4.3798 4.7962 5.5747 3.6863 4.6042 5.0500 4.5061 2.8689 1.2316 5.5934 2.7877 4.9910 1.6292 2.9608 2.1318 4.4479 3.9625 3.2668 1.3866 2.7599 3.3069 6.7059 3.6078 1.1593 4.8078 5.8000 4.8393 1.7982 1.8509 2.0167 4.2415 2.1263 1.5825 2.4453 1.6790 8.6399 2.6672 1.9761 1.3719 1.2600 1.3413 2.7529 1.1872 1.1712 2.0659 3.9541 1.8372 2.6055 1.3145 4.8854 3.4043 1.1829 1.3861 1.4864 1.0506 1.0770 2.4769 6.9459 1.1937 6.2507 5.4421 7.3057 1.0329 1.0608 1.1041 1.1001 1.0898 1.0905 1.0986 1.0939 1.0953 1.0761 1.0457 1.1041
irintensity: 13.6692 2.6481 3.6539 0.8754 7.1216 0.8801 1.0097 3.5896 3.2211 0.1353 6.1545 2.1644 2.5328 44.8943 0.0509 40.3965 2.7311 12.2602 46.7815 163.8437 33.5169 26.6205 1.0600 1.6402 48.7284 15.2033 32.6030 9.9458 25.4053 0.4456 37.6342 9.5167 5.3918 2.5581 3.5735 1.3808 45.0304 6.5123 11.5885 15.6300 0.1595 1.0732 157.1423 23.0792 32.0020 16.3938 181.8073 27.3631 127.9506 2.1022 9.7524 2.4501 36.8130 429.9358 272.9301 12.8637 57.0291 126.8223 8.8864 56.8236 35.4692 84.8110 486.7265 61.9547 12.7184 46.0621 3.0607 11.0623 22.7288 9.9429 11.8737 3.3785 86.5674 34.5994 35.3187
temp: 298.150 k
press: 1.00000 atm
elementType: 8 8 8 7 7 6 6 6 6 6 6 6 6 6 6 1 1 1 1 1 1 1 1 1 1 1 1
symmnumber: 1
zpe: 551501.1 jmol-1
zpe.correction: 0.210056 hartree
zpe.thermalcorrener: 0.225036 hartree
zpe.thermalcorrenthalpy: 0.225981 hartree
zpe.thermalcorrgfe: 0.164304 hartree
zpe.sumelectzpe: -722.344285 hartree
zpe.sumelectthermal: -722.329304 hartree
zpe.sumelectthermalent: -722.328360 hartree
zpe.sumelectthermalfe: -722.390036 hartree
dipole: -7.9636 3.0624 0.2301
dipole: 8.5352
quadrupole: -114.8728 -79.8312 -81.5696
quadrupole: 2.6711 13.3066 1.7000
quadrupole: -22.7816 12.2600 10.5216 2.6711 13.3066 1.7000
hfenergy: -722.5543403 hartree
pointgroup: C01 [X(C10H12N2O3)]
dipole: -2.8041184 -1.3826195 -1.2253658 debye
polarizability: 163.819437|26.4813977|118.6055874|24.8437546|12.2199797|117.605984 unknown
InChI: InChI=1S/C10H12N2O3/c1-15-8-4-2-7(3-5-8)6-9(13)12-10(11)14/h2-5,12H,6,11H2,1H3
charge 0 multiplicity 1
27 atoms
O  -3.599514 -1.029061 -1.091244
O  3.224427 1.587773 1.803708
O  4.504861 -0.77913 0.553136
N  2.245044 -0.032619 0.394936
N  3.126852 -1.53426 -1.168571
C  -0.382567 0.852741 0.95803
C  0.781566 1.540068 1.648167
C  -0.85553 1.301652 -0.308262
C  -1.024437 -0.267788 1.542563
C  -2.547175 -0.463281 -0.359516
C  -1.921104 0.657969 -0.963206
C  -2.096733 -0.929353 0.901297
C  2.214451 1.041291 1.301719
C  3.39516 -0.773534 -0.029187
C  -4.303373 -2.170687 -0.498709
H  0.701002 1.447307 2.747072
H  0.78905 2.624718 1.435163
H  -0.387915 2.174736 -0.779647
H  -0.686213 -0.630195 2.521038
H  -2.292956 1.008091 -1.930935
H  -2.568685 -1.786574 1.390467
H  1.328155 -0.329977 0.044171
H  -3.622738 -3.031679 -0.351568
H  -5.083036 -2.435244 -1.227514
H  -4.771678 -1.896872 0.466393
H  2.29403 -1.416141 -1.742897
H  3.878556 -2.131246 -1.506801
