program: Gaussian 09
title: 000284773
version: EM64L-G09RevD.01
frameworkgroup: C1[X(C10H13NOS)]
method: RPBEPBE
basis: SDD
operation: Freq
keyword: #p
keyword: freq=noraman
keyword: PBEPBE/SDD
title: #p freq=noraman PBEPBE/SDD
converged: YES YES NO NO
title: Mulliken charges:
elementType: S O N C C C C C C C C C C H H H H H H H H H H H H H
charge: 0.123760 -0.192183 -0.604422 -0.033765 -0.662875 -0.691019 0.409244 -0.249963 -0.350514 -0.314231 -0.220637 -0.229327 -0.222643 0.238192 0.269159 0.290324 0.210706 0.221227 0.229793 0.278197 0.275504 0.273557 0.250107 0.234419 0.233078 0.234313
chargesum: 0.00000
title: Mulliken charges with hydrogens summed into heavy atoms:
elementType: S O N C C C C C C C C C C
charge: 0.123760 -0.192183 -0.050720 0.204427 -0.103392 -0.029294 0.409244 -0.249963 -0.076957 -0.064124 0.013781 0.003751 0.011670
polarizability: 2.13213699e+02 -5.27272715e-02 1.33029825e+02 -1.31782496e+01 2.62437386e+00 7.46514996e+01
1716.lowfreq: -6.9260 -2.7125 -0.0001 0.0003 0.0012 11.9292 25.0938 34.2253 48.1774
frequency: 24.8073 34.1481 48.1525 61.2572 142.4707 159.4320 186.3177 207.6921 235.8180 277.9904 291.7023 364.6898 387.3198 397.4455 409.4229 429.4561 449.9398 522.5889 580.8536 612.7706 630.6674 669.7267 691.7068 697.0626 783.9657 821.2852 856.6532 867.8929 884.2756 945.3953 957.4512 989.2340 989.4117 996.1623 1006.7001 1025.8606 1078.2583 1087.5845 1126.8835 1174.5659 1186.1851 1204.0452 1210.3597 1229.6240 1270.2286 1319.6755 1338.2691 1370.6448 1380.9674 1388.1042 1411.4051 1435.6548 1472.6882 1476.3370 1477.6999 1573.8760 1601.0500 1608.2321 1636.5898 2912.1949 2978.3244 3032.8309 3071.8685 3091.5340 3118.1485 3130.6021 3139.4148 3149.9761 3161.0106 3171.1668 3466.3352 3597.4824
redmass: 3.8914 5.0077 6.3489 3.2996 4.6325 4.6878 4.0752 1.0952 1.3212 2.0436 5.7069 3.7827 2.3105 2.8086 8.1754 3.8838 2.6013 8.1388 1.3398 6.4356 4.9535 7.4226 1.9162 4.0382 1.8912 2.1208 1.2524 1.7725 4.9292 1.4224 1.7235 2.1882 2.3551 1.5284 1.3344 2.1666 1.6025 1.5731 2.0277 1.0644 1.2523 1.4654 2.7087 1.4195 1.1632 1.3128 1.2947 1.5319 1.2696 9.1428 1.1225 2.2488 1.0523 2.0810 1.0742 7.5804 7.8238 6.1061 1.1003 1.0834 1.0358 1.0577 1.0996 1.0993 1.1067 1.0852 1.0883 1.0928 1.0961 1.1012 1.0448 1.0986
irintensity: 0.4642 0.7645 1.8027 0.9194 2.1263 0.0889 8.2493 40.6060 29.5108 3.4483 31.7686 6.3426 2.2708 0.0867 1.9311 1.2093 20.9817 7.2798 240.5744 0.9457 19.3564 65.0656 35.7606 53.6396 45.6916 1.0751 0.2326 16.4970 164.2314 4.0531 1.3994 0.8598 0.6395 0.3964 0.3423 2.1670 4.3961 11.6229 17.6040 4.2247 92.0150 50.5982 104.2845 12.6559 2.4518 2.7016 18.1424 5.4618 46.0546 4.1275 10.5499 14.8371 5.9331 6.6297 7.3757 88.0599 63.6603 13.7004 41.7773 54.0401 32.4361 15.7388 37.3344 28.2155 3.8244 0.2536 6.5393 15.4328 14.6524 23.6051 0.1121 0.8640
temp: 298.150 k
press: 1.00000 atm
elementType: 16 8 7 6 6 6 6 6 6 6 6 6 6 1 1 1 1 1 1 1 1 1 1 1 1 1
symmnumber: 1
zpe: 548592.7 jmol-1
zpe.correction: 0.208948 hartree
zpe.thermalcorrener: 0.222713 hartree
zpe.thermalcorrenthalpy: 0.223657 hartree
zpe.thermalcorrgfe: 0.166613 hartree
zpe.sumelectzpe: -915.930423 hartree
zpe.sumelectthermal: -915.916657 hartree
zpe.sumelectthermalent: -915.915713 hartree
zpe.sumelectthermalfe: -915.972757 hartree
dipole: -1.2121 -0.5546 1.5001
dipole: 2.0068
quadrupole: -67.9480 -81.8146 -87.8796
quadrupole: 2.3459 3.1310 1.0954
quadrupole: 11.2661 -2.6006 -8.6655 2.3459 3.1310 1.0954
hfenergy: -916.1393704 hartree
pointgroup: C01 [X(C10H13N1O1S1)]
dipole: -0.4460444 -0.4667611 0.4544465 debye
dipolederiv: -0.7583192 0.1326465 0.1526209 0.4002081 -0.2704381 -0.2147825 0.4356178 -0.1415098 -0.3408041 -0.7271815 -0.2075468 -0.0280802 0.0546929 -0.8172509 -0.3574888 0.1675706 -0.3137653 -0.4892411 -0.8756915 -0.2204559 0.0680984 -0.2330204 -0.4013508 0.0388644 0.0351932 0.0410501 -0.6035337 0.5880728 0.1626384 -0.018013 0.0423974 0.3168201 0.0009385 0.3619851 0.0536373 0.2996143 0.5572753 0.0415329 0.0115583 0.3075746 -0.0128331 0.0018233 -0.1152146 0.008161 0.0535226 -0.0013681 0.0150145 -0.0278097 0.0004379 -0.1395254 -0.036192 -0.026456 -0.0069785 0.0878304 -0.6737431 -0.1110345 0.1077153 -0.0222012 -0.0579452 -0.0405165 0.1828131 -0.0103274 -0.0375269 1.7451727 0.0856051 -0.36365 -0.4421565 0.8232952 0.5660008 -0.7930707 0.4679522 0.5655645 0.0522157 0.1321179 0.0322269 -0.1096978 0.0017828 0.0859686 -0.1210959 0.0270145 -0.0618798 0.0388757 -0.0420775 -0.0719814 0.0790158 -0.0498331 0.0142339 0.0249575 0.0550627 -0.0886117 -0.1126206 -0.1477456 -0.1058062 -0.1730372 -0.0590821 0.101337 -0.1167915 0.0977608 -0.0632759 -0.169955 0.1102235 0.0671639 0.1635753 0.0718254 0.091624 0.1031711 0.1010043 -0.1169316 0.0969072 0.0494991 -0.0418977 0.0514165 -0.0081742 0.0625408 -0.035604 0.0611658 -0.0867198 -0.1310406 -0.0551496 0.1211628 -0.0210677 -0.0250871 -0.0092934 0.1322202 0.0196256 -0.1033461 -0.0399221 -0.0032546 0.0873856 -0.0207023 0.1097845 -0.0348463 0.0079357 -0.0080641 -0.0382903 -0.0113895 0.0363623 -0.0125272 -0.0240449 -0.0552959 0.0394145 -0.0806439 -0.0301344 0.0883966 -0.0239601 0.0825591 -0.1067965 0.0548293 0.0527254 0.0424001 -0.1538065 0.0843455 -0.0888955 -0.0108685 0.0459521 0.1060684 -0.0122014 0.0863439 0.0267831 0.1427995 -0.0301202 -0.0639165 -0.0004952 -0.1404064 -0.0217031 -0.1288204 0.0202461 -0.0122039 -0.0069846 -0.0394989 0.0863675 0.155231 0.0233547 -0.1028821 0.0201266 0.1485724 0.044837 -0.3030757 0.0281269 0.1809923 0.1824732 0.0747816 -0.007138 0.0353933 0.0587415 -0.0873618 -0.0175433 -0.1406861 0.2788628 0.1269184 -0.0727692 -0.0315075 -0.0351532 0.0323227 -0.0624556 -0.0079407 -0.0533106 0.1247269 0.0724536 0.0663429 0.0692339 0.0892775 0.0776387 -0.05781 0.0708502 -0.0637493 0.0961907 -0.0080263 0.0599227 0.0805242 0.0718745 0.0313602 -0.0954155 0.0915189 -0.0924912 0.0787596 0.0418273 -0.0646364 -0.0070003 -0.0939008 -0.0352187 -0.0900723 -0.0239499 -0.0954085 0.1077789 -0.1128417 -0.0534767 0.0430343 -0.0548161 0.1005758 -0.0183276 0.0455445 -0.0188623 0.134366 unknown
polarizability: 211.0051658|7.9095884|118.4575863|-20.1186472|24.910758|91.4322711 unknown
InChI: InChI=1S/C10H13NOS/c1-8(11)7-13-10(12)9-5-3-2-4-6-9/h2-6,8H,7,11H2,1H3
charge 0 multiplicity 1
26 atoms
S  1.109734 -0.606376 -1.294064
O  0.593721 1.52974 0.342225
N  4.724774 0.73226 0.240454
C  3.574841 -0.188122 0.115371
C  2.768418 0.284502 -1.116797
C  4.091096 -1.629395 -0.049304
C  -1.340016 0.112935 -0.025643
C  0.090433 0.511073 -0.195867
C  -2.176864 0.978061 0.732055
C  -1.883871 -1.076335 -0.57904
C  -3.53508 0.658973 0.929076
C  -3.243572 -1.392757 -0.378781
C  -4.07223 -0.527376 0.374341
H  2.894421 -0.152058 0.997746
H  3.323165 0.096128 -2.050112
H  2.525105 1.357077 -1.030642
H  4.627944 -1.962925 0.858887
H  4.786559 -1.686981 -0.907096
H  3.252177 -2.325415 -0.223464
H  5.525768 0.35066 0.750721
H  4.481559 1.682072 0.536699
H  -1.740755 1.890186 1.152264
H  -1.248313 -1.753046 -1.160469
H  -4.174736 1.33037 1.512079
H  -3.657415 -2.312032 -0.806763
H  -5.128159 -0.776323 0.528126
