program: Gaussian 09
title: 000284817
version: EM64L-G09RevD.01
frameworkgroup: C1[X(C18H24ClN5)]
method: RPBEPBE
basis: SDD
operation: Freq
keyword: #p
keyword: freq=noraman
keyword: PBEPBE/SDD
title: #p freq=noraman PBEPBE/SDD
converged: YES YES NO NO
title: Mulliken charges:
elementType: Cl N N N N N C C C C C C C C C C C C C C C C C C H H H H H H H H H H H H H H H H H H H H H H H H
charge: -0.064059 -0.102441 -0.412423 -0.198125 -0.043055 -0.063503 0.297583 -0.439008 -0.120542 -0.365478 0.274179 0.014445 0.115793 -0.329699 -0.328048 -0.018798 -0.307629 -0.307148 -0.806449 -0.668828 -0.669529 -0.623565 -0.305022 -0.109875 0.212103 0.212291 0.243790 0.232939 0.333495 0.195385 0.207983 0.190053 0.209530 0.250321 0.227635 0.208717 0.212202 0.230679 0.204271 0.212348 0.286014 0.226336 0.225342 0.264988 0.238891 0.239217 0.262765 0.253930
chargesum: 0.00000
title: Mulliken charges with hydrogens summed into heavy atoms:
elementType: Cl N N N N N C C C C C C C C C C C C C C C C C C
charge: -0.064059 -0.102441 -0.078928 -0.198125 -0.043055 -0.063503 0.297583 -0.014614 -0.120542 0.111251 0.274179 0.014445 0.115793 0.073669 0.071535 -0.018798 -0.057309 -0.021134 -0.089783 -0.020274 -0.022230 0.117308 -0.051092 -0.109875
polarizability: 3.04299115e+02 6.09144764e+00 3.43597166e+02 2.43003136e+01 -6.48936344e+00 1.47365351e+02
1716.lowfreq: -5.0179 -3.8647 0.0005 0.0016 0.0016 3.0244 12.3934 24.2973 31.5094
frequency: 11.8333 24.0381 31.4706 48.8416 58.0025 69.4076 81.4182 88.5295 107.2130 112.0846 132.2582 150.9004 163.2775 176.6899 186.4114 200.3547 217.2171 222.4860 232.6912 239.8550 250.2496 271.7367 288.8476 304.9851 311.8112 317.4433 357.3566 381.1040 390.4693 418.8864 440.1615 450.1669 465.7765 488.5882 510.8533 533.8598 592.2455 594.3013 602.0386 617.4968 651.5597 664.5070 679.2807 688.7731 726.3745 748.6823 771.5790 793.2644 796.6051 808.5112 820.0781 879.2372 886.9265 898.5495 918.3010 937.0554 945.1088 972.5176 991.7826 1024.7919 1040.8467 1041.8967 1057.2645 1065.5883 1073.7911 1076.7429 1083.0530 1085.2398 1121.8487 1128.1784 1132.4625 1161.6784 1173.3826 1204.1010 1208.5450 1237.7182 1243.6166 1255.7867 1266.2040 1283.4029 1290.5947 1295.2184 1313.4895 1334.4374 1356.9142 1362.7263 1368.0770 1378.6172 1384.8276 1386.6514 1389.2554 1391.6563 1417.9924 1433.6363 1438.2334 1452.3212 1461.1860 1464.6464 1467.6833 1469.6049 1471.0196 1476.0437 1477.6887 1483.3576 1485.3473 1485.9619 1488.8048 1491.5521 1496.0325 1506.2075 1513.0127 1562.0437 1599.2967 1611.5860 2858.6618 2863.4832 2875.3341 2958.5683 2978.6576 2982.2227 2985.8416 2995.8448 3016.5005 3022.9855 3029.9698 3039.0112 3053.1843 3073.9557 3078.8977 3083.5525 3092.8957 3093.5606 3094.6246 3119.6041 3165.8425 3181.8891 3195.5385 3532.6232
redmass: 4.1130 3.3939 4.5288 3.8187 4.6032 2.5176 2.0482 1.9528 1.4334 3.3196 5.1989 2.7779 2.4457 1.5355 2.1614 1.1520 2.9716 1.6792 3.9424 3.1269 2.8967 4.2714 2.1402 2.9339 4.4699 3.6652 4.0164 4.1587 6.7255 3.0641 3.6428 3.5729 2.6765 3.1704 1.5378 4.3529 5.3954 6.1276 4.9854 5.8280 8.0589 5.6529 6.7716 6.8203 4.5123 2.6523 2.0892 1.1295 1.2288 2.6158 1.2508 5.7030 1.5381 6.3476 1.9398 4.9598 1.3294 1.9088 2.3387 2.6559 2.6957 1.5154 2.7981 1.8433 2.1799 1.9379 2.7387 2.2838 1.7190 1.3023 2.6612 2.3653 1.8413 2.1068 2.2447 2.6219 1.5434 1.8552 2.8824 1.2143 1.2443 1.1865 1.9707 1.9292 5.2112 1.3721 1.3465 1.4379 3.1758 1.2349 1.2322 1.2887 1.9977 3.3972 2.8833 2.5018 1.0654 1.0571 1.6401 1.0497 1.0621 1.0776 1.0777 1.1711 1.1356 1.0895 1.4651 1.0930 1.1189 2.8963 3.3694 8.6967 4.7068 6.5942 1.0720 1.0708 1.0705 1.0391 1.0611 1.0359 1.0358 1.0334 1.0875 1.0888 1.0986 1.0878 1.1022 1.0980 1.0984 1.1024 1.1003 1.1004 1.0947 1.1008 1.0892 1.0928 1.0938 1.0751
irintensity: 0.6128 0.0553 0.0524 0.0134 0.1254 0.0357 0.4505 2.1993 1.0922 0.3354 0.4135 2.4313 3.4092 1.7777 0.7844 0.4118 0.9290 0.9789 1.1195 4.4306 0.1160 0.6654 2.2771 1.4723 2.5268 2.8182 7.9951 2.2656 2.4239 7.2196 12.9943 23.9170 9.8461 2.5596 44.4764 2.8111 4.7674 12.1548 7.2275 7.3308 4.9875 29.2388 19.5512 21.7102 0.2977 7.9887 29.0563 4.5765 8.5764 13.7368 2.9898 26.4121 23.5819 59.9049 0.7321 22.8840 1.8149 4.0033 5.1680 1.7439 8.1307 2.5739 8.9591 16.2444 4.2564 43.5814 45.0592 2.9128 14.1320 0.8451 15.4771 27.1551 25.5416 18.1144 37.5201 23.8995 12.8926 38.5724 11.9857 7.7336 23.0138 8.1609 26.1831 42.9147 33.3761 0.6643 3.3740 13.1252 23.8862 22.5958 21.3816 26.7322 12.5274 139.3902 17.0102 13.9607 3.2923 13.3051 103.1942 17.4707 0.0895 22.6351 1.6171 25.4710 1.8330 16.6436 24.5300 18.2724 11.4017 81.9835 57.7396 330.7836 259.7040 141.6344 57.0261 40.0824 179.2050 33.8656 42.4537 28.5568 29.1038 78.8395 9.2445 23.7227 20.5196 12.2814 33.8007 62.2650 62.8991 23.9332 24.2861 51.0458 11.3733 4.1954 0.1527 0.1946 8.8659 45.2672
temp: 298.150 k
press: 1.00000 atm
elementType: 17 7 7 7 7 7 6 6 6 6 6 6 6 6 6 6 6 6 6 6 6 6 6 6 1 1 1 1 1 1 1 1 1 1 1 1 1 1 1 1 1 1 1 1 1 1 1 1
symmnumber: 1
zpe: 1035171.5 jmol-1
zpe.correction: 0.394276 hartree
zpe.thermalcorrener: 0.419086 hartree
zpe.thermalcorrenthalpy: 0.420031 hartree
zpe.thermalcorrgfe: 0.337371 hartree
zpe.sumelectzpe: -1432.333555 hartree
zpe.sumelectthermal: -1432.308745 hartree
zpe.sumelectthermalent: -1432.307800 hartree
zpe.sumelectthermalfe: -1432.390460 hartree
dipole: -6.3153 -2.2825 0.0124
dipole: 6.7151
quadrupole: -140.7760 -160.7338 -151.5769
quadrupole: -4.7316 0.8443 1.0130
quadrupole: 10.2529 -9.7049 -0.5480 -4.7316 0.8443 1.0130
hfenergy: -1432.727831 hartree
pointgroup: C01 [X(C18H24Cl1N5)]
dipole: 2.1803864 1.4882899 0.1032776 debye
polarizability: 302.7613195|-1.5051303|342.2838258|-28.4725964|18.7005454|150.2164861 unknown
InChI: InChI=1S/C18H24ClN5/c1-5-24(6-2)10-9-20-17-14-8-7-13(19)11-15(14)21-18-16(17)12(3)22-23(18)4/h7-8,11,20H,5-6,9-10H2,1-4H3
charge 0 multiplicity 1
48 atoms
Cl -2.075915 -5.569438 -0.641775
N  4.419656 0.630313 0.180185
N  0.725837 0.888884 -0.585842
N  -3.723253 1.753581 0.571816
N  -3.255447 -0.617502 0.270565
N  -3.037707 2.974149 0.493906
C  -0.536871 0.356653 -0.367076
C  3.098244 1.27058 0.007984
C  -1.604709 1.242902 -0.039353
C  2.046704 0.241709 -0.474298
C  -0.878149 -1.054458 -0.454764
C  -2.898498 0.682165 0.25675
C  -1.760251 2.67213 0.133366
C  4.581374 -0.007253 1.517233
C  5.564561 1.499966 -0.202842
C  -2.239594 -1.476521 -0.097374
C  0.024967 -2.06678 -0.930032
C  -2.57342 -2.87418 -0.145143
C  -0.763658 3.788851 -0.029844
C  5.574703 -1.184386 1.507715
C  5.705411 1.669799 -1.727303
C  -5.1323 1.706209 0.942786
C  -0.329515 -3.414362 -0.9976
C  -1.635143 -3.79818 -0.575791
H  3.184057 2.071243 -0.752067
H  2.733511 1.75496 0.948101
H  1.990377 -0.592505 0.248104
H  2.397411 -0.169938 -1.440664
H  0.758191 1.909612 -0.619126
H  4.8891 0.743776 2.287687
H  3.59097 -0.386621 1.831947
H  5.499063 2.504091 0.287908
H  6.484557 1.025043 0.18226
H  1.016177 -1.790574 -1.292171
H  5.249563 -1.950678 0.782962
H  6.594835 -0.863847 1.229286
H  5.633004 -1.646216 2.51078
H  5.830062 0.684563 -2.208909
H  4.820292 2.158109 -2.17524
H  6.585146 2.295988 -1.965816
H  -3.585742 -3.160199 0.149359
H  0.088708 3.691126 0.671408
H  -0.362167 3.843201 -1.061366
H  -1.261151 4.749622 0.1817
H  -5.284029 2.142506 1.945008
H  -5.745917 2.262418 0.213181
H  -5.435619 0.64746 0.9502
H  0.371677 -4.162976 -1.375601
