program: Gaussian 09
title: 000284818
version: EM64L-G09RevD.01
frameworkgroup: C1[X(C20H17ClN4O2)]
method: RPBEPBE
basis: SDD
operation: Freq
keyword: #p
keyword: freq=noraman
keyword: PBEPBE/SDD
title: #p freq=noraman PBEPBE/SDD
converged: YES YES NO NO
title: Mulliken charges:
elementType: Cl O O N N N N C C C C C C C C C C C C C C C C C C C C H H H H H H H H H H H H H H H H H
charge: -0.052915 -0.279957 -0.319778 -0.195457 -0.512117 -0.019144 -0.050599 -0.067781 0.242339 0.000150 0.272227 0.099481 -0.013453 -0.382507 0.346703 -0.777555 -0.291463 -0.620912 -0.255719 -0.117545 0.042980 -0.354565 -0.313898 -0.218221 -0.256653 0.199017 -0.497406 0.375991 0.249630 0.234799 0.259367 0.248353 0.286635 0.243210 0.240985 0.261518 0.257046 0.272588 0.271504 0.234054 0.234640 0.245205 0.235706 0.243516
chargesum: 0.00000
title: Mulliken charges with hydrogens summed into heavy atoms:
elementType: Cl O O N N N N C C C C C C C C C C C C C C C C C C C C
charge: -0.052915 -0.279957 -0.319778 -0.195457 -0.136126 -0.019144 -0.050599 -0.067781 0.242339 0.000150 0.272227 0.099481 -0.013453 -0.132877 0.346703 -0.035037 -0.004828 0.124801 0.001327 -0.117545 0.042980 -0.081977 -0.042394 0.015833 -0.022013 0.199017 0.227022
polarizability: 3.99059117e+02 -1.23124811e+01 3.34438166e+02 -8.24327378e+00 9.05480502e+00 1.72040300e+02
1716.lowfreq: -3.9465 -0.0015 -0.0013 0.0005 4.5024 8.1016 18.8166 30.6280 42.0744
frequency: 18.7511 30.5982 42.0677 68.1107 73.1477 88.0495 92.0721 103.0992 109.3970 117.8002 127.5508 142.4744 153.7460 157.7777 171.8369 213.4854 219.0312 231.5540 239.0183 248.3023 277.3835 306.2093 310.9572 330.0648 356.9868 384.8966 390.4897 398.3954 434.7753 443.0595 457.4305 495.3658 519.1419 533.5049 557.7459 589.9931 593.9322 602.6509 626.2500 642.8928 660.7200 669.0778 678.1968 679.9222 711.0721 733.0287 744.7536 770.6068 773.0326 784.1971 791.1902 815.1855 832.9270 873.6039 887.9010 893.6344 909.6591 921.6162 937.1643 960.0947 971.2771 979.6879 992.9122 1037.7655 1042.4788 1045.1209 1056.6191 1060.7160 1095.5309 1113.2617 1128.6295 1137.7985 1149.9105 1157.4119 1177.3459 1192.9181 1224.7142 1241.3091 1242.9768 1266.9647 1273.4661 1305.9730 1324.6728 1350.1499 1382.6069 1385.8486 1398.0866 1404.7702 1419.1682 1425.2359 1431.7695 1440.1964 1446.7929 1451.6024 1453.4774 1461.7652 1463.2283 1466.3629 1469.4493 1483.1092 1490.7637 1504.9571 1509.6038 1553.8679 1567.9703 1581.0088 1605.5112 1610.0243 1629.8168 2989.8192 2998.2782 3007.0001 3069.8848 3086.9112 3104.1520 3109.7928 3122.0309 3135.5918 3146.7179 3151.5479 3156.8382 3168.3196 3177.5806 3181.3538 3181.3774 3228.5338
redmass: 5.4907 6.5544 4.6316 5.6106 2.6951 2.1099 1.5464 1.8690 2.8422 3.8677 2.5570 1.5280 4.4855 3.4285 2.7310 5.1859 5.5497 4.8721 5.6769 3.1976 4.9040 6.8765 6.8458 4.4908 6.3314 7.7015 7.3566 4.9956 3.6987 3.3297 6.4702 6.3810 3.4313 5.0475 6.0282 6.8791 5.0606 4.9261 6.6936 6.1570 5.9650 6.3018 5.0003 6.4927 6.2895 4.6280 2.4005 5.4892 1.3671 2.3540 1.7202 3.3736 3.2506 1.4406 1.5348 5.7859 6.7946 7.9965 5.6305 1.3344 1.3708 1.9617 1.3282 2.2077 2.3378 1.4679 4.4774 2.1044 3.7516 1.2597 1.3017 1.6786 1.5274 2.1604 1.0834 2.1693 3.4427 2.2974 1.5775 4.1743 2.6921 2.5645 2.5792 3.2975 4.9305 4.7306 2.3910 1.6303 2.8363 1.7006 1.6729 2.0352 2.6048 1.0502 3.1766 1.1138 1.0579 1.5392 1.0530 1.6121 2.0024 2.5145 3.5374 8.3757 6.3400 7.2997 3.3531 6.8675 4.5767 1.0367 1.0335 1.0295 1.0974 1.1023 1.0990 1.1047 1.1009 1.0869 1.0882 1.1049 1.0898 1.0949 1.0958 1.0985 1.0937 1.0793
irintensity: 0.0920 0.8467 0.0130 0.3278 0.6512 1.7209 1.5958 0.3666 0.2769 0.1670 2.0230 5.2201 0.9276 3.1302 3.4318 2.7214 5.5598 5.1381 1.5409 4.0546 0.8193 1.3614 1.7037 26.3776 1.8018 8.3666 3.5274 3.2815 2.1272 22.4361 16.2604 8.3897 14.5978 2.8006 14.8923 9.3275 5.8836 12.9821 3.0558 12.0780 7.5572 16.5072 9.0129 26.8423 21.6496 7.7029 34.7334 4.0732 111.6996 21.4304 77.9439 15.6274 11.9016 1.3857 24.3082 54.6426 70.6061 14.5851 9.7940 0.8141 1.7373 1.3504 0.2313 17.4154 18.9516 2.9270 123.6995 28.9361 53.0562 0.0628 0.8009 20.6680 119.8906 14.3074 3.9516 31.4799 65.7300 95.1327 36.0190 251.6428 239.3182 2.5774 87.0025 105.8785 2.0841 13.5033 47.9622 1.2702 49.1567 45.2089 41.8576 21.0541 47.6242 15.2057 27.0438 19.0029 9.6834 63.9131 15.5244 39.4256 5.0634 151.5281 389.8957 228.3537 62.9381 257.1407 204.6356 38.7497 123.8218 17.9819 77.0775 43.0688 9.7277 20.8047 10.2406 23.2681 3.9283 5.4091 3.1238 18.8038 11.4827 6.5549 3.3764 12.6937 1.7345 296.2590
temp: 298.150 k
press: 1.00000 atm
elementType: 17 8 8 7 7 7 7 6 6 6 6 6 6 6 6 6 6 6 6 6 6 6 6 6 6 6 6 1 1 1 1 1 1 1 1 1 1 1 1 1 1 1 1 1
symmnumber: 1
zpe: 870581.8 jmol-1
zpe.correction: 0.331587 hartree
zpe.thermalcorrener: 0.355759 hartree
zpe.thermalcorrenthalpy: 0.356703 hartree
zpe.thermalcorrgfe: 0.276611 hartree
zpe.sumelectzpe: -1599.975617 hartree
zpe.sumelectthermal: -1599.951445 hartree
zpe.sumelectthermalent: -1599.950501 hartree
zpe.sumelectthermalfe: -1600.030594 hartree
dipole: -4.4442 -0.0282 0.2803
dipole: 4.4531
quadrupole: -153.9575 -158.4425 -160.0078
quadrupole: 17.5730 0.8937 6.5706
quadrupole: 3.5117 -0.9732 -2.5385 17.5730 0.8937 6.5706
hfenergy: -1600.307204 hartree
pointgroup: C01 [X(C20H17Cl1N4O2)]
dipole: 1.7224571 0.2680888 -0.1753742 debye
polarizability: 392.6588713|20.921819|324.2625016|-10.9125151|-51.3865845|188.6162104 unknown
InChI: InChI=1S/C20H17ClN4O2/c1-11-17-18(22-15-7-5-4-6-14(15)20(26)27-3)13-9-8-12(21)10-16(13)23-19(17)25(2)24-11/h4-10,22H,1-3H3
charge 0 multiplicity 1
44 atoms
Cl -4.614159 -4.479613 0.73675
O  4.93518 -0.980223 1.216982
O  2.726777 -1.289742 1.860361
N  -2.748424 2.838942 -0.197998
N  0.836652 -0.262054 0.311526
N  -3.434576 0.519737 0.026575
N  -1.561871 3.585416 -0.155109
C  -1.053999 1.340306 0.021115
C  -0.543115 0.032988 0.196525
C  -2.498806 1.482071 -0.066012
C  -1.499411 -1.042327 0.318527
C  -0.538765 2.698163 -0.021188
C  -2.92989 -0.748015 0.237242
C  -1.093097 -2.408442 0.493858
C  1.840826 0.042636 -0.610476
C  0.864002 3.214275 0.129501
C  -3.874188 -1.821166 0.371519
C  -4.043711 3.499628 -0.311579
C  -2.025268 -3.436967 0.619849
C  -3.415651 -3.116134 0.563226
C  3.220997 -0.234844 -0.286676
C  1.541454 0.58085 -1.898158
C  4.23944 0.070571 -1.234075
C  2.566566 0.862022 -2.814044
C  3.927873 0.62073 -2.486265
C  3.56656 -0.864559 1.000025
C  5.332335 -1.626417 2.490349
H  1.170926 -0.82213 1.120521
H  -0.02642 -2.653339 0.516097
H  1.351104 2.786529 1.024479
H  1.497276 2.959233 -0.738232
H  0.836213 4.311452 0.231896
H  -4.937771 -1.577335 0.316524
H  -4.17795 4.224938 0.508725
H  -4.126925 4.029854 -1.275965
H  -4.820393 2.721405 -0.249835
H  -1.707781 -4.47478 0.751184
H  0.497995 0.759245 -2.172155
H  5.275653 -0.145056 -0.959785
H  2.305296 1.268122 -3.797789
H  4.720404 0.847159 -3.205742
H  4.938607 -1.055024 3.347284
H  6.430943 -1.615476 2.47552
H  4.943889 -2.657628 2.533623
