program: Gaussian 09
title: 000284805
version: EM64L-G09RevD.01
frameworkgroup: C1[X(C16H26Cl2N4O2)]
method: RPBEPBE
basis: SDD
operation: Freq
keyword: #p
keyword: freq=noraman
keyword: PBEPBE/SDD
title: #p freq=noraman PBEPBE/SDD
converged: YES YES NO NO
title: Mulliken charges:
elementType: Cl Cl O O N N N N C C C C C C C C C C C C C C C C H H H H H H H H H H H H H H H H H H H H H H H H H H
charge: -0.039503 -0.039502 -0.220343 -0.220343 -0.389438 -0.389431 -0.095657 -0.095663 -0.511771 -0.511783 -0.298479 -0.298469 -0.330114 -0.330096 0.662211 0.662182 -0.630350 -0.630358 0.111885 0.111923 -0.618935 -0.607526 -0.618944 -0.607525 0.228991 0.212622 0.228994 0.212616 0.246848 0.276586 0.246818 0.276611 0.196647 0.205873 0.205869 0.196647 0.311754 0.311752 0.228998 0.189554 0.227595 0.229204 0.224241 0.189106 0.229006 0.189555 0.227594 0.229203 0.224240 0.189105
chargesum: 0.00000
title: Mulliken charges with hydrogens summed into heavy atoms:
elementType: Cl Cl O O N N N N C C C C C C C C C C C C C C C C
charge: -0.039503 -0.039502 -0.220343 -0.220343 -0.077684 -0.077678 -0.095657 -0.095663 -0.070159 -0.070173 0.224955 0.224960 0.072406 0.072420 0.662211 0.662182 -0.630350 -0.630358 0.111885 0.111923 0.027212 0.035025 0.027211 0.035023
polarizability: 3.77245732e+02 2.55798892e+01 2.39091545e+02 4.07266223e-02 7.28614404e-02 1.71561925e+02
1716.lowfreq: 0.0016 0.0022 0.0024 3.1691 5.7221 6.8547 10.1482 15.3703 27.3636
frequency: 8.9882 15.3193 27.0453 28.4738 41.5329 44.7195 48.2701 73.2039 73.6966 92.2919 102.0359 127.2400 135.6083 155.5312 169.2879 180.9135 188.4754 204.9708 211.8105 218.3874 236.0733 239.8033 242.0270 254.8662 282.2402 294.0141 310.5832 312.9321 322.6412 350.4452 351.4334 353.1595 376.4280 377.6530 412.9740 415.4429 418.0726 441.9045 448.6026 496.7006 500.3615 509.5353 546.5596 583.2316 655.1416 660.9623 731.9280 735.9267 746.9115 748.8755 807.1121 818.0109 820.2356 824.7863 829.5325 874.6040 888.8090 901.8484 956.7662 973.6417 992.9901 1013.4534 1037.8065 1037.8482 1063.9355 1063.9824 1075.7111 1084.0577 1088.7244 1095.7490 1101.6540 1102.7005 1135.2789 1135.6518 1170.4536 1171.4601 1215.1385 1215.3468 1232.0480 1258.4005 1264.4043 1268.8984 1271.6498 1282.8600 1290.8933 1295.4057 1325.4185 1326.5663 1357.3936 1357.6475 1370.5567 1371.0800 1379.6110 1392.0419 1420.9483 1420.9707 1439.6242 1442.8178 1443.6282 1447.3198 1458.8630 1459.0644 1463.6737 1463.9252 1467.3446 1470.4675 1473.9636 1474.9954 1475.1516 1475.9116 1481.3241 1482.0714 1486.4959 1486.5400 1525.8463 1546.5891 1596.5354 1603.1628 2838.4566 2838.4978 2851.2203 2851.2434 2866.6929 2867.2212 2985.1221 2985.2131 2998.7830 2998.8107 3015.9739 3016.2985 3021.5659 3021.6727 3030.5558 3030.5922 3056.5985 3056.6471 3075.2023 3075.2285 3080.0202 3080.0294 3085.8452 3085.8916 3444.2013 3444.2858
redmass: 4.5061 5.9888 3.9763 5.5906 4.0503 2.5995 3.2592 16.2006 5.8874 3.6128 3.6359 6.3767 3.6962 3.1104 4.3591 2.8481 2.6976 1.6930 3.0619 1.2577 1.5128 1.2752 1.4732 5.3600 9.6814 10.0714 2.3274 2.5832 3.6837 2.7610 6.3628 2.9104 2.2637 2.4026 2.8235 2.0362 2.7925 3.8735 7.9791 3.4202 2.8827 3.5215 3.7591 3.7522 1.5421 1.4083 2.1869 2.4122 9.5929 7.0122 6.0162 2.4898 4.2503 10.4337 2.5878 2.9200 2.7106 3.3250 1.8801 1.9277 2.0981 2.1390 1.5404 1.5449 1.8977 1.8918 2.2291 1.5532 1.4814 1.9707 2.2377 2.4784 1.4536 1.4730 2.0337 1.8553 1.3443 1.2504 4.7313 1.7547 1.8037 2.4469 2.1034 2.0795 1.2750 1.6589 1.3831 1.3301 1.4990 1.4586 1.5185 1.4084 4.5722 6.2290 1.1408 1.1408 1.3247 1.1723 1.1734 1.2797 1.0640 1.0667 1.0543 1.0536 1.1068 1.1226 1.1215 1.0645 1.0627 1.1493 1.0649 1.0920 1.0553 1.0552 10.0304 10.6023 4.5825 4.9128 1.0699 1.0699 1.0570 1.0570 1.0577 1.0577 1.0666 1.0667 1.0873 1.0873 1.0614 1.0615 1.0729 1.0729 1.0724 1.0724 1.0943 1.0943 1.1027 1.1026 1.1011 1.1011 1.1004 1.1004 1.0749 1.0750
irintensity: 0.7809 0.0872 0.0831 0.1449 1.1872 0.8822 0.5698 2.0527 0.0887 0.7461 2.7100 4.2656 0.7939 1.3832 0.8765 5.3756 0.2732 0.7325 0.8817 0.0500 2.9924 1.3698 0.4632 0.2002 0.3944 0.1479 23.7229 1.7019 2.8688 2.0508 19.2190 0.0809 0.1121 2.0809 1.5235 2.6994 12.5864 5.5011 0.9527 16.4693 0.0783 6.2207 18.8149 0.4416 212.5342 14.1032 85.5970 1.6675 1.5437 0.2428 84.8802 18.3822 0.6192 2.4878 0.1716 26.3528 0.0056 2.3988 4.6032 30.4501 47.3566 11.2900 14.3804 15.6936 13.9140 12.4227 7.5192 1.4262 14.5107 5.8914 1.7778 18.2586 8.7281 3.8643 38.3109 4.4117 32.7593 12.3142 52.3163 0.0098 8.3892 6.1584 34.0482 0.0018 0.0542 3.9006 0.1402 2.5443 1.8039 21.8978 8.8789 12.5258 0.9039 153.9397 5.3997 1.5392 8.5842 5.1663 29.5393 0.2178 14.7202 1.5695 3.2117 13.0265 69.3255 2.6990 56.0209 22.4510 6.0650 0.4909 24.4576 6.3196 16.3489 12.0551 1.8400 1101.6530 283.2725 4.7581 100.2147 35.5402 124.4521 27.4619 519.5077 124.8657 50.7934 42.4817 43.8433 18.3238 24.6406 19.4147 52.1577 16.8441 18.2877 45.4710 53.0481 33.1918 16.9123 13.5965 23.9770 34.8494 9.0480 72.6869 121.0868 3.1811
temp: 298.150 k
press: 1.00000 atm
elementType: 17 17 8 8 7 7 7 7 6 6 6 6 6 6 6 6 6 6 6 6 6 6 6 6 1 1 1 1 1 1 1 1 1 1 1 1 1 1 1 1 1 1 1 1 1 1 1 1 1 1
symmnumber: 1
zpe: 1072192.0 jmol-1
zpe.correction: 0.408376 hartree
zpe.thermalcorrener: 0.436076 hartree
zpe.thermalcorrenthalpy: 0.437020 hartree
zpe.thermalcorrgfe: 0.346061 hartree
zpe.sumelectzpe: -1912.944248 hartree
zpe.sumelectthermal: -1912.916549 hartree
zpe.sumelectthermalent: -1912.915605 hartree
zpe.sumelectthermalfe: -1913.006563 hartree
dipole: 0.0003 -0.0028 1.9379
dipole: 1.9379
quadrupole: -106.5991 -177.9895 -154.4168
quadrupole: -8.3727 -0.0101 -0.0278
quadrupole: 39.7361 -31.6544 -8.0817 -8.3727 -0.0101 -0.0278
hfenergy: -1913.3526246 hartree
pointgroup: C01 [X(C16H26Cl2N4O2)]
dipole: -0.000074 -0.7624269 0.0004254 debye
polarizability: 376.6038248|0.0314273|171.5618515|27.2507179|0.0136641|239.7335255 unknown
InChI: InChI=1S/C16H26Cl2N4O2/c1-21(2)9-5-7-19-13-11(17)16(24)14(12(18)15(13)23)20-8-6-10-22(3)4/h19-20H,5-10H2,1-4H3
charge 0 multiplicity 1
50 atoms
Cl -1.378454 0.877277 2.940993
Cl 1.378875 0.876171 -2.941915
O  1.578568 0.935709 2.274332
O  -1.57815 0.934473 -2.275285
N  -2.807256 0.850717 0.286387
N  2.807677 0.851115 -0.287246
N  -5.236997 -1.916383 -0.289934
N  5.236589 -1.915861 0.291098
C  -5.235141 0.599269 -0.069061
C  5.235525 0.599657 0.068536
C  -3.862321 0.759231 -0.74988
C  3.86268 0.760303 0.749142
C  -5.424345 -0.770495 0.627912
C  5.424567 -0.770635 -0.627442
C  -1.450415 0.868035 0.156202
C  1.450829 0.868247 -0.157115
C  -0.610367 0.881238 1.276729
C  0.610784 0.880712 -1.277654
C  0.828734 0.897084 1.240322
C  -0.828323 0.896133 -1.241259
C  -6.308642 -2.046876 -1.29736
C  -4.999704 -3.184069 0.430752
C  6.307874 -2.04605 1.298949
C  4.999119 -3.183933 -0.428837
H  -6.01347 0.741656 -0.84075
H  -5.395406 1.404899 0.677326
H  6.013818 0.742486 0.84018
H  5.395968 1.404725 -0.678418
H  -3.833625 1.658491 -1.39049
H  -3.666732 -0.109959 -1.400445
H  3.834052 1.66006 1.389062
H  3.666941 -0.108361 1.400361
H  -6.432792 -0.786879 1.11836
H  -4.680725 -0.877714 1.442582
H  4.681156 -0.878182 -1.442258
H  6.433157 -0.787634 -1.117579
H  -3.135773 0.865164 1.260303
H  3.136241 0.865122 -1.261154
H  -6.374061 -1.135895 -1.916642
H  -7.316356 -2.232071 -0.844448
H  -6.075986 -2.88967 -1.971785
H  -4.131234 -3.073951 1.104187
H  -4.767864 -3.984033 -0.294926
H  -5.874707 -3.519529 1.043808
H  6.37336 -1.134721 1.917713
H  7.315682 -2.23181 0.846478
H  6.074758 -2.888371 1.973806
H  4.13089 -3.073976 -1.10261
H  4.766802 -3.983356 0.297284
H  5.874202 -3.520065 -1.041411
