program: Gaussian 09
title: 000284768
version: EM64L-G09RevD.01
frameworkgroup: C1[X(C9H14N2S)]
method: RPBEPBE
basis: SDD
operation: Freq
keyword: #p
keyword: freq=noraman
keyword: PBEPBE/SDD
title: #p freq=noraman PBEPBE/SDD
converged: YES YES NO NO
title: Mulliken charges:
elementType: S N N C C C C C C C C C H H H H H H H H H H H H H H
charge: 0.224005 -0.098232 -0.298425 -0.412310 -0.419311 -0.405483 -0.367064 -0.362005 -0.126839 -0.295728 -0.130540 -0.518433 0.239830 0.213367 0.216997 0.239566 0.216575 0.190387 0.213466 0.207893 0.254595 0.200683 0.233201 0.280868 0.241389 0.261546
chargesum: 0.00000
title: Mulliken charges with hydrogens summed into heavy atoms:
elementType: S N N C C C C C C C C C
charge: 0.224005 -0.098232 -0.043830 0.040887 0.037252 0.001479 0.054296 0.071879 -0.126839 -0.014860 0.110849 -0.256887
polarizability: 1.69662533e+02 1.44858946e+00 1.18684482e+02 -4.24563206e+00 -8.65609401e-01 7.99879705e+01
1716.lowfreq: -0.0008 0.0016 0.0017 3.5764 6.0910 17.6298 29.3385 40.9394 64.6578
frequency: 29.1477 40.6609 64.4436 74.1165 131.0162 133.5868 156.1996 220.0542 240.0152 283.7038 360.7361 424.1712 450.5304 464.2171 561.2244 570.4121 684.9737 690.3745 700.9373 718.7451 726.0950 793.6240 817.7151 822.6036 828.0308 842.6804 912.3295 960.2729 971.5230 992.1131 1019.2954 1032.5921 1061.1223 1074.8548 1077.2914 1083.0611 1108.4442 1122.3207 1138.4185 1146.3489 1150.0452 1193.0181 1218.9670 1244.8508 1257.8185 1279.2797 1299.9060 1330.7044 1356.7098 1393.3657 1449.9856 1454.2194 1465.5981 1474.7576 1479.8659 1483.5034 1494.6150 1560.9681 2856.5678 2893.2447 2906.2304 2973.0305 2997.7628 3021.5033 3051.4891 3061.4696 3163.3931 3170.8018 3180.6916 3193.8729 3238.0102 3432.6304
redmass: 4.8177 3.6745 3.3488 3.3826 2.9558 2.0803 3.3941 6.2587 3.2220 3.3161 2.4897 3.5834 3.6361 4.6116 3.2455 6.7671 5.5927 1.2323 1.3585 3.6005 3.3163 1.5791 4.4092 2.1449 1.3213 1.2383 1.3509 1.9439 1.2555 1.8782 1.7683 1.8269 1.3285 1.4957 1.3534 1.8608 1.8356 2.0314 1.6477 1.6076 2.9743 1.2944 1.4318 1.2731 2.8576 1.2265 1.3129 2.0484 1.4408 1.4866 1.2156 1.0843 1.1112 1.5500 1.5351 1.5392 1.0892 5.7431 1.0717 1.0687 1.0663 1.0850 1.0886 1.0958 1.0506 1.0623 1.1141 1.0900 1.1151 1.0972 1.1002 1.0743
irintensity: 0.0308 0.4538 0.6329 3.8244 1.8655 4.8139 3.1094 0.0781 3.5385 0.3266 2.2142 4.1681 3.4246 9.1723 2.8391 2.5074 2.3547 107.1503 87.7936 16.4899 3.5880 4.3769 11.1683 1.4105 2.2978 21.2785 3.1825 12.7289 2.5746 16.9647 29.9134 2.7012 9.2554 14.3881 9.0878 8.5417 1.5188 47.5439 0.3689 3.2021 16.7680 11.1854 30.5998 7.4269 31.0854 2.4279 4.8233 0.4987 1.9928 7.0394 41.5987 3.6279 0.3981 17.3619 1.2932 7.1763 4.6985 2.5041 74.4310 3.5851 151.8476 26.4607 0.2228 69.3578 35.8466 32.5270 1.8886 8.1891 44.8782 1.5040 1.0986 0.2561
temp: 298.150 k
press: 1.00000 atm
elementType: 16 7 7 6 6 6 6 6 6 6 6 6 1 1 1 1 1 1 1 1 1 1 1 1 1 1
symmnumber: 1
zpe: 563793.3 jmol-1
zpe.correction: 0.214738 hartree
zpe.thermalcorrener: 0.227391 hartree
zpe.thermalcorrenthalpy: 0.228335 hartree
zpe.thermalcorrgfe: 0.173595 hartree
zpe.sumelectzpe: -857.900567 hartree
zpe.sumelectthermal: -857.887914 hartree
zpe.sumelectthermalent: -857.886970 hartree
zpe.sumelectthermalfe: -857.941710 hartree
dipole: -0.7928 1.1779 0.3066
dipole: 1.4525
quadrupole: -75.8963 -78.2046 -81.4710
quadrupole: -1.8986 -3.8520 -1.8335
quadrupole: 2.6277 0.3194 -2.9470 -1.8986 -3.8520 -1.8335
hfenergy: -858.115305 hartree
pointgroup: C01 [X(C9H14N2S1)]
dipole: -0.2846536 0.4826697 -0.1121955 debye
dipolederiv: -0.1375434 -0.0003865 0.0055201 0.0756773 -0.2691593 0.1366427 -0.0226021 0.1430761 0.059331 -0.7442221 0.1204181 0.1258438 0.1929356 -0.4052551 -0.0783336 0.1428134 -0.0798978 -0.104212 -0.931328 0.0007103 -0.069912 -0.0430069 -0.511842 0.1069278 -0.1187821 0.1204993 -0.1875554 0.1731726 0.0629766 0.006046 0.0442857 0.1818777 0.0235688 -0.0335545 0.0482693 -0.0152477 0.1522814 0.0491682 -0.0803473 0.0264078 0.1726301 -0.0269495 -0.0899619 -0.0355715 -0.0065731 0.4849298 0.0030336 -0.0931376 0.0050725 0.236706 0.0402501 -0.0710308 0.0633246 0.2090687 0.5372145 0.1402373 -0.0516321 0.0642282 0.3657609 0.0529129 -0.2312404 0.0165082 0.155522 0.4839633 -0.076427 0.1024328 0.0425442 0.3908644 0.0047179 0.3463322 0.0021432 0.3093074 0.2983038 -0.1897452 0.010108 -0.2638858 0.172484 -0.1353889 -0.0791429 -0.1899947 -0.1344671 -0.0987947 -0.0809091 0.0213555 -0.0546324 -0.2311584 0.0295326 0.0547915 0.0560837 -0.1908252 0.005124 0.1409714 -0.0682348 0.0392723 -0.1178875 -0.0165273 -0.0362085 -0.0258111 -0.1347085 -0.2008761 0.0833373 -0.0495974 0.0892036 0.2351178 -0.2263925 -0.0445164 -0.2319167 -0.2505831 -0.1223216 -0.0319252 -0.0911303 -0.054977 0.0539537 -0.0050184 -0.104679 0.0167803 0.0560366 0.0261475 -0.0760899 0.0089393 0.0242752 -0.1025652 0.1203207 -0.0130948 0.0919888 0.0471835 0.030624 -0.1228621 -0.0382319 -0.0781921 -0.0423516 -0.1108385 -0.0021153 -0.0549776 -0.0021152 0.0263601 -0.0557013 0.0768018 -0.0759425 0.0490243 0.0629459 0.1123095 0.0278616 -0.0557398 -0.0123137 0.0165257 0.0577959 0.013749 0.0618052 -0.0489325 0.0760072 -0.0366756 -0.1606218 -0.0508368 -0.0080613 0.0244735 -0.1008019 -0.220848 0.0206951 -0.0037958 -0.0349831 0.0505568 0.0395734 -0.0120848 0.0096531 -0.0102646 0.0440654 -0.0564675 0.0597182 -0.0344879 -0.1507614 -0.085542 -0.0335257 0.000312 -0.1416134 -0.2282656 0.0062512 0.0266211 -0.015648 0.050303 0.1427194 0.0139618 0.0036486 0.0452029 0.2294268 -0.1016382 0.0210833 -0.0297493 -0.0030547 -0.0721604 0.0411467 -0.0301938 0.1119314 -0.2451851 0.0531289 -0.0796191 -0.0006395 0.0440609 -0.0593934 -0.020419 0.0975997 0.0321071 0.0540948 -0.0366073 0.0429859 -0.007248 -0.1201293 0.0666231 0.0732795 -0.0165139 0.1254824 0.0566257 0.0443507 -0.0229059 0.0506846 0.1739337 0.0754439 -0.041979 0.0226842 -0.0916706 -0.0287597 0.0907729 0.0366655 0.089595 0.1561659 -0.0271486 0.0043496 0.0157168 -0.0173881 0.0988406 0.0500761 0.0339217 0.0507858 0.2051246 unknown
polarizability: 169.7532571|-2.8387987|110.365083|-1.9314201|-15.9503654|88.2166459 unknown
InChI: InChI=1S/C9H14N2S/c1-2-9(12-7-1)8-10-3-4-11-5-6-11/h1-2,7,10H,3-6,8H2
charge 0 multiplicity 1
26 atoms
S  3.743808 -1.233642 0.595814
N  -3.943419 -0.337078 -0.301866
N  -0.166961 -0.243303 -0.152831
C  -5.046016 0.636446 -0.634629
C  -4.602809 0.44769 0.808946
C  -2.566112 0.103571 -0.659116
C  -1.542823 -0.641149 0.215902
C  0.889005 -0.832323 0.698037
C  2.239517 -0.256546 0.342466
C  2.549864 0.995769 -0.165897
C  3.965433 1.215435 -0.360196
C  4.748422 0.13153 -0.000916
H  -5.979262 0.187267 -0.987823
H  -4.773252 1.584443 -1.120047
H  -4.03325 1.26836 1.268632
H  -5.213674 -0.139138 1.501705
H  -2.404845 -0.14939 -1.726086
H  -2.40854 1.202724 -0.543048
H  -1.70675 -0.371858 1.278099
H  -1.729747 -1.737899 0.126395
H  0.029138 -0.408458 -1.150364
H  0.931291 -1.949709 0.647001
H  0.639865 -0.585915 1.751251
H  1.773246 1.730769 -0.386764
H  4.384019 2.146148 -0.751559
H  5.830255 0.017159 -0.035508
