program: Gaussian 09
title: 000284767
version: EM64L-G09RevD.01
frameworkgroup: C1[X(C12H20N2)]
method: RPBEPBE
basis: SDD
operation: Freq
keyword: #pfreq=noraman
keyword: PBEPBE/SDD
title: #p freq=noraman PBEPBE/SDD
converged: NO YES NO NO
title: Mulliken charges:
elementType: N N C C C C C C C C C C C C H H H H H H H H H H H H H H H H H H H H
charge: -0.290739 -0.096696 -0.111676 -0.207381 -0.201739 -0.508961 -0.527355 -0.441837 -0.235440 -0.234256 -0.413330 -0.417917 -0.359112 -0.408535 0.219043 0.249204 0.232920 0.224178 0.218933 0.247613 0.210049 0.225680 0.195706 0.242722 0.236318 0.235433 0.238222 0.212197 0.215854 0.238043 0.212409 0.188975 0.207817 0.203657
chargesum: 0.00000
title: Mulliken charges with hydrogens summed into heavy atoms:
elementType: N N C C C C C C C C C C C C
charge: -0.055306 -0.096696 0.107367 0.041822 0.031180 -0.065850 -0.069693 -0.020451 0.007282 0.002063 0.037089 0.035980 0.052363 -0.007151
polarizability: 1.66535269e+02 4.28488142e+00 1.18309290e+02 5.59440092e+00 -3.23710356e+00 1.20003049e+02
1716.lowfreq: -15.8955 -0.0010 -0.0010 -0.0008 5.2398 12.0965 25.8146 35.1200 60.2610
frequency: 25.7045 34.6942 60.2008 75.0329 120.9027 129.8089 144.4304 204.3839 241.4732 271.5249 349.5397 361.8278 427.4219 442.8331 461.7964 479.8964 548.3951 654.8493 686.4265 722.1293 726.7561 737.1563 783.6385 792.6279 821.9737 822.2640 823.6878 833.8673 896.9591 913.0347 932.0170 935.7975 949.2399 963.3355 970.6783 977.6286 987.6313 1011.1355 1029.5598 1056.9846 1058.3377 1066.8562 1075.0781 1080.4446 1086.4645 1095.1304 1115.5932 1125.8037 1138.0911 1142.3560 1146.7364 1170.8680 1181.7002 1205.5920 1223.3000 1253.1249 1254.8327 1257.8200 1259.5061 1267.7911 1276.7355 1292.2529 1299.3765 1318.2839 1339.3588 1355.6204 1388.8330 1446.8870 1454.0580 1462.6998 1463.9422 1475.7659 1476.7308 1482.6772 1493.9499 1579.0361 2844.9291 2887.0394 2900.9574 2958.0303 2996.2434 2999.3442 3002.1508 3005.4289 3019.8482 3049.2511 3058.9937 3060.8159 3075.5206 3083.5839 3100.7714 3150.1318 3161.6410 3179.0620 3184.7549 3404.1626
redmass: 4.1136 2.6381 3.2936 3.5460 2.4718 2.8193 3.0395 2.4311 3.7579 2.9320 2.3121 2.2612 2.8492 3.4328 1.9001 2.7947 2.7174 3.7676 1.3459 2.7125 1.6634 3.1181 3.5249 1.4703 1.9634 1.9610 1.8927 2.3709 2.1860 1.8037 1.7990 1.7188 2.2333 1.7347 1.2736 1.6463 1.9662 2.0079 1.7654 1.7016 1.7476 1.6529 1.3210 1.1806 1.9556 1.5452 1.2061 1.4111 1.9181 2.0581 1.5068 2.0924 1.4364 1.5465 1.4116 1.4786 1.3595 2.0037 1.4175 1.5560 1.2909 1.3667 1.4002 1.5084 1.4852 1.4587 1.4921 1.2148 1.0815 1.1058 1.0938 1.1017 1.1351 1.0962 1.0809 5.6863 1.0714 1.0693 1.0665 1.0827 1.0881 1.0603 1.0654 1.0835 1.0949 1.0506 1.0624 1.1045 1.0908 1.1033 1.0912 1.0874 1.1138 1.1150 1.1092 1.0735
irintensity: 0.3428 1.2554 0.4017 2.1638 1.4138 3.1031 3.1097 0.3318 0.0942 1.4182 0.6673 2.6276 4.0399 2.7861 8.2665 4.4811 4.3925 0.3822 80.2702 10.0319 59.1395 11.8609 4.4840 4.3233 5.1632 3.3239 3.5563 7.8158 2.9225 4.5591 2.6896 4.6385 3.0357 0.2714 2.0561 0.8682 24.7759 3.1349 10.8283 9.3155 9.6695 2.3289 12.0514 1.9500 9.8547 2.1289 8.7713 10.7791 16.1072 25.1547 12.4253 1.1183 2.5535 8.0516 4.7682 8.4120 0.5521 16.7937 5.8699 3.6716 4.9127 4.7227 3.1425 7.4205 15.5022 0.8820 2.4579 30.5441 3.5542 0.5091 8.7178 10.4114 6.9786 9.1571 3.6649 2.1126 91.6075 12.1052 153.5787 24.1136 1.3919 55.2105 25.3107 48.7109 67.5915 37.5136 33.3595 28.8509 70.9198 43.7769 22.4333 10.3880 2.2269 46.6906 19.3904 2.3609
temp: 298.150 k
press: 1.00000 atm
elementType: 7 7 6 6 6 6 6 6 6 6 6 6 6 6 1 1 1 1 1 1 1 1 1 1 1 1 1 1 1 1 1 1 1 1
symmnumber: 1
zpe: 785608.8 jmol-1
zpe.correction: 0.299223 hartree
zpe.thermalcorrener: 0.312930 hartree
zpe.thermalcorrenthalpy: 0.313874 hartree
zpe.thermalcorrgfe: 0.256985 hartree
zpe.sumelectzpe: -577.566126 hartree
zpe.sumelectthermal: -577.552419 hartree
zpe.sumelectthermalent: -577.551474 hartree
zpe.sumelectthermalfe: -577.608364 hartree
dipole: -0.1326 -0.0078 0.3493
dipole: 0.3737
quadrupole: -86.1947 -86.2037 -84.0586
quadrupole: 8.4066 3.7079 -3.4374
quadrupole: -0.7090 -0.7181 1.4270 8.4066 3.7079 -3.4374
hfenergy: -577.8653486 hartree
pointgroup: C01 [X(C12H20N2)]
dipole: -0.0525961 -0.0022924 0.1372713 debye
polarizability: 166.3998308|4.8617325|118.3443485|5.7408792|-3.1446801|120.103428 unknown
InChI: InChI=1S/C12H20N2/c1-2-11-7-10(1)8-12(11)9-13-3-4-14-5-6-14/h1-2,10-13H,3-9H2
charge 0 multiplicity 1
34 atoms
N  0.69728 -0.70165 0.322703
N  4.445251 -0.333614 -0.054351
C  -1.782762 -0.954599 0.204789
C  -2.13262 0.373308 1.001267
C  -3.988139 0.048642 -0.283562
C  -3.04985 -1.152736 -0.707029
C  -3.658126 0.139027 1.240592
C  -0.459017 -0.920817 -0.577098
C  -2.18549 1.514051 -0.019916
C  -3.298616 1.3226 -0.789045
C  5.534148 0.490114 0.583255
C  4.866918 0.964269 -0.700503
C  2.007994 -0.658878 -0.36283
C  3.125521 -0.308087 0.635024
H  -1.731765 -1.78037 0.946186
H  -1.492094 0.540792 1.878221
H  -5.044185 -0.079292 -0.5672
H  -3.543569 -2.122367 -0.512052
H  -2.799083 -1.109888 -1.782455
H  -4.151076 0.992923 1.735213
H  -3.877639 -0.79555 1.790984
H  -0.491065 -0.089666 -1.308647
H  -0.367093 -1.865968 -1.172535
H  -1.405253 2.268176 -0.153477
H  -3.603203 1.889728 -1.673694
H  0.702754 -1.395776 1.085963
H  6.53584 0.050324 0.555834
H  5.294687 1.045564 1.501556
H  4.187023 1.824984 -0.61987
H  5.383093 0.867827 -1.66058
H  3.160853 -1.067527 1.441784
H  2.891149 0.676297 1.10764
H  1.958786 0.122381 -1.146745
H  2.274948 -1.614318 -0.875925
