program: Gaussian 09
title: 000284743
version: EM64L-G09RevD.01
frameworkgroup: C1[X(C10H11IO4)]
method: RPBEPBE
basis: SDD
operation: Freq
keyword: #p
keyword: freq=noraman
keyword: PBEPBE/SDD
title: #p freq=noraman PBEPBE/SDD
converged: YES YES NO NO
title: Mulliken charges:
elementType: I O O O O C C C C C C C C C C H H H H H H H H H H H
charge: 0.091240 -0.303093 -0.295230 -0.412609 -0.212072 0.670080 -0.524934 -0.701733 0.223039 -0.545909 0.207432 -0.251161 0.213268 -0.529867 -0.529627 0.260379 0.271304 0.287048 0.272471 0.253562 0.231736 0.230557 0.233568 0.226301 0.255215 0.379034
chargesum: 0.00000
title: Mulliken charges with hydrogens summed into heavy atoms:
elementType: I O O O O C C C C C C C C C C
charge: 0.091240 -0.303093 -0.295230 -0.033575 -0.212072 0.670080 -0.264555 -0.143381 0.223039 -0.545909 0.207432 0.021310 0.213268 0.185987 0.185457
polarizability: 2.13451222e+02 -7.45537619e+00 1.40037376e+02 -4.75048618e+00 -8.95140908e+00 8.65033996e+01
1716.lowfreq: -0.0008 -0.0007 -0.0006 0.9199 4.7770 7.7833 30.3324 36.1326 47.5503
frequency: 30.0947 36.0650 47.4977 55.8840 93.3843 107.2788 131.7610 149.3151 163.0181 171.6387 195.7779 211.2393 248.1267 276.3267 299.0787 317.4492 373.5303 410.8757 452.6896 489.8521 500.7010 540.4780 587.1309 611.7658 638.6180 663.5474 712.8844 736.5889 759.9585 844.8821 881.1472 897.9585 906.8638 929.2315 948.3411 988.3626 1043.9537 1110.5178 1113.3416 1115.7746 1149.8117 1158.3812 1168.3329 1183.0932 1236.3793 1246.6385 1265.4778 1333.4022 1355.3015 1368.0150 1422.7698 1438.3278 1445.3466 1457.6091 1458.4567 1470.5260 1476.9619 1487.2043 1548.3409 1602.7086 1675.5404 2975.9418 2977.6391 3005.7796 3063.7904 3073.6763 3075.0923 3125.1319 3126.6886 3149.3802 3176.8451 3515.9348
redmass: 7.6305 11.2663 5.2182 4.1444 4.7901 2.8962 5.1512 1.3638 1.0887 2.5122 3.8975 7.3124 4.9034 6.3750 4.3014 4.3153 4.9637 5.5392 2.9608 3.0002 2.7961 4.5092 5.8487 5.1482 1.4835 6.4587 6.2781 3.2785 5.6034 3.7081 1.5564 4.3252 1.8396 2.1954 8.1000 4.1145 2.5585 2.6238 1.2425 1.3863 1.3772 1.5487 1.5073 1.4005 1.2907 1.5709 4.8709 2.0205 5.4154 4.7068 1.2198 1.2152 1.1702 1.0543 1.1470 2.2998 1.0800 1.0524 8.8686 7.3255 8.5332 1.0306 1.0306 1.0618 1.0979 1.1043 1.1046 1.1030 1.1029 1.0919 1.0925 1.0640
irintensity: 0.2964 0.8966 0.3271 3.2880 2.7846 5.9608 3.1042 0.4228 0.0640 0.6734 5.7220 1.8877 3.9264 5.9492 4.9104 2.4944 0.3316 1.5241 8.7635 13.9354 20.9466 62.2403 9.6867 9.5124 140.2680 1.3069 3.2893 11.1789 5.4393 5.2358 7.1756 44.9177 38.5418 5.7334 112.2270 20.7889 341.3569 90.1068 14.8390 3.6563 3.3851 16.8418 16.2107 13.6462 1.4080 22.1497 141.1566 45.9924 16.0599 29.7666 11.8635 42.6302 25.2798 16.3909 37.5615 152.5338 11.8624 21.6221 6.4901 8.8195 185.1572 81.0653 59.3899 10.3179 1.1047 32.2113 17.6598 23.3628 21.5067 3.5589 1.0206 26.0518
temp: 298.150 k
press: 1.00000 atm
elementType: 53 8 8 8 8 6 6 6 6 6 6 6 6 6 6 1 1 1 1 1 1 1 1 1 1 1
symmnumber: 1
zpe: 502476.2 jmol-1
zpe.correction: 0.191383 hartree
zpe.thermalcorrener: 0.207608 hartree
zpe.thermalcorrenthalpy: 0.208552 hartree
zpe.thermalcorrgfe: 0.144722 hartree
zpe.sumelectzpe: -698.910002 hartree
zpe.sumelectthermal: -698.893777 hartree
zpe.sumelectthermalent: -698.892833 hartree
zpe.sumelectthermalfe: -698.956663 hartree
dipole: -1.6858 0.7360 -1.2773
dipole: 2.2395
quadrupole: -83.2033 -95.5002 -106.5732
quadrupole: 4.9322 -0.0445 1.1290
quadrupole: 11.8889 -0.4079 -11.4810 4.9322 -0.0445 1.1290
hfenergy: -699.1013846 hartree
pointgroup: C01 [X(C10H11I1O4)]
dipole: 0.5057631 -0.4480475 -0.5654599 debye
dipolederiv: -0.2505717 0.2335109 0.0511863 0.2699632 -0.2951716 -0.0689901 0.0573567 -0.0783702 -0.021266 -1.0024156 0.6122403 -0.1226927 0.513807 -0.9139947 0.1432957 -0.0590936 0.088303 -0.3798483 -1.5806003 -0.0426328 0.0990606 -0.0084621 -0.3951402 0.0251605 -0.0832609 0.0165506 -0.3484122 -1.375788 -0.0549917 -0.3330955 -0.0497724 -0.3919211 -0.0641441 -0.1603292 -0.0305894 -0.3244171 -0.7007852 -0.0888638 -0.0164196 0.0206123 -0.3841579 0.2171353 -0.1725012 0.2268312 -0.8023612 0.0156991 0.2938505 0.0780236 0.1476985 -0.2007223 -0.0426778 0.0176751 -0.0312281 -0.0320988 -0.095166 0.0089379 -0.0076044 0.0607516 -0.0847347 0.075188 -0.0441054 0.0791251 -0.1095603 -0.0743358 -0.004043 0.0985944 -0.0403177 0.0992058 0.0664786 0.2575968 0.1324956 -0.1501421 0.5202425 -0.5050765 0.0507065 -0.702062 0.6978931 -0.0457969 -0.2240369 0.1486948 -0.0305014 0.4549199 -0.5864316 -0.1180902 -0.5748132 0.6033137 0.2188161 -0.1465438 0.2428886 -0.0973816 1.1668811 0.0740651 0.0606151 0.2035501 0.1121861 0.0363671 0.4263008 0.0003478 -0.0105084 -0.4029796 0.080158 0.0332994 0.3021995 -0.2242308 0.0098807 0.1560046 -0.0393559 -0.0501289 1.6925542 0.1750779 0.1893447 0.0769326 0.3727923 -0.3017889 0.059646 -0.3836762 1.0391574 0.4503933 -0.2378299 0.0809129 -0.1083992 0.4072879 -0.146742 0.2654659 -0.3871565 0.3846683 0.6995068 0.0652561 -0.1427773 -0.0668526 0.2377714 -0.0678503 -0.4142336 -0.090376 0.3373085 0.0679793 -0.0177648 -0.0305739 -0.0211783 -0.0244071 -0.073823 -0.0312912 -0.0694301 0.1138579 0.0671017 0.0009342 0.0393059 -0.0518451 -0.0112119 -0.1061032 -0.0156718 -0.0619385 0.0468752 0.0046657 0.0190429 -0.0231174 0.0427475 0.0292541 0.0777035 -0.011703 0.0287762 0.1128595 0.0944488 -0.0255812 -0.0279212 -0.0292706 0.0225669 -0.0567499 -0.0375139 -0.0554316 0.1299744 0.0330307 -0.0295937 -0.0641547 -0.1045843 0.0361555 -0.0865222 -0.0872504 -0.0008676 -0.0050919 -0.0164684 0.1472229 0.0251388 0.147754 -0.0424892 -0.0144907 0.0418792 -0.0381261 0.0575404 -0.0383652 -0.1054321 0.100707 -0.0218042 0.0094135 0.0775055 -0.0174209 0.155544 -0.0237411 -0.1515032 -0.0336207 -0.0513674 -0.0400413 0.1136099 -0.0027752 -0.083877 -0.0130031 0.0401607 0.0255833 0.0564449 -0.0215132 -0.021536 -0.0602125 0.1314156 0.1315392 0.1207897 -0.0365215 0.0868542 -0.012299 0.0054499 0.0731527 -0.038908 -0.0970821 0.0802815 -0.0597414 0.0138434 0.3091182 -0.0225808 0.0469825 -0.0182299 0.3258519 0.0965901 0.095087 0.0989439 0.1457352 unknown
polarizability: 197.5830357|-31.9278489|152.923307|4.0008158|15.3006453|89.4856545 unknown
InChI: InChI=1S/C10H11IO4/c1-14-8-3-6(4-10(12)13)7(11)5-9(8)15-2/h3,5,12H,4H2,1-2H3
charge 0 multiplicity 1
26 atoms
I  -1.997733 2.922023 0.501605
O  2.23068 -1.74081 -0.589586
O  3.034361 0.781536 0.690964
O  -4.681243 -0.52866 -0.295379
O  -3.014795 -1.022827 1.245966
C  -1.002165 0.140665 -0.556292
C  -0.017613 -0.858282 -0.757691
C  -2.426411 -0.114667 -1.003117
C  1.317792 -0.691374 -0.344012
C  -0.589862 1.334881 0.091212
C  1.714318 0.536413 0.259037
C  0.747453 1.538805 0.487978
C  -3.341922 -0.594473 0.122019
C  2.817876 -2.343697 0.632979
C  4.054543 0.779774 -0.386393
H  -0.290515 -1.809438 -1.227145
H  -2.451804 -0.896466 -1.785797
H  -2.889825 0.783966 -1.447618
H  1.072363 2.466009 0.966722
H  3.340461 -1.581527 1.238331
H  3.525966 -3.104204 0.271018
H  2.023535 -2.821859 1.235823
H  5.01697 0.928276 0.12567
H  3.865283 1.6161 -1.085113
H  4.048518 -0.178219 -0.936003
H  -5.267633 -0.861944 0.437126
