program: Gaussian 09
title: 000284742
version: EM64L-G09RevD.01
frameworkgroup: C1[X(C10H9NO6)]
method: RPBEPBE
basis: SDD
operation: Freq
keyword: #p
keyword: freq=noraman
keyword: PBEPBE/SDD
title: #p freq=noraman PBEPBE/SDD
converged: YES YES NO NO
title: Mulliken charges:
elementType: O O O O O O N C C C C C C C C C C H H H H H H H H H
charge: -0.278965 -0.277553 -0.196676 -0.201773 -0.188458 -0.218836 0.030577 0.330960 0.285855 0.408921 -0.560764 -0.304021 -0.304684 0.262898 0.264712 -0.743634 -0.744184 0.314333 0.264118 0.314836 0.250470 0.248061 0.276724 0.250774 0.257656 0.258651
chargesum: 0.00000
title: Mulliken charges with hydrogens summed into heavy atoms:
elementType: O O O O O O N C C C C C C C C C C
charge: -0.278965 -0.277553 -0.196676 -0.201773 -0.188458 -0.218836 0.030577 0.330960 0.285855 0.408921 -0.246431 -0.039902 0.010152 0.262898 0.264712 0.031620 0.022898
polarizability: 2.19074453e+02 3.15573872e-01 1.42513781e+02 -5.04333303e+00 7.71377694e+00 7.60666680e+01
1716.lowfreq: -11.6887 -3.8833 -0.5566 -0.0008 0.0006 0.0006 23.9870 28.9381 42.0091
frequency: 23.9757 28.9278 41.9902 64.1505 73.7110 90.0004 97.9520 108.2733 128.8655 147.3267 204.1307 215.2078 257.8107 294.6180 334.4480 367.2616 378.3730 414.1709 436.3182 494.7056 517.0010 531.4944 549.7509 555.8051 602.3606 632.1124 676.2082 690.3000 699.7174 734.0497 752.0957 794.6908 852.0991 864.5254 928.9464 935.7214 982.3403 984.4249 994.0103 1036.9886 1040.8876 1054.8215 1127.0886 1141.9054 1166.8989 1174.7836 1206.7752 1220.9707 1249.4584 1361.5398 1375.7548 1382.2839 1385.7367 1420.6827 1449.7173 1450.9355 1451.7130 1451.7254 1472.8428 1565.8261 1618.6341 1667.6493 1706.0540 3010.0858 3010.2186 3097.4970 3103.2700 3146.6300 3147.7196 3171.2618 3191.3402 3215.2324
redmass: 10.4407 6.1130 3.3198 1.3127 3.3027 2.2227 1.6740 3.6935 5.6616 7.7950 8.6378 10.8181 3.7992 11.6464 4.2443 6.1008 7.5124 6.2356 3.8036 4.7082 3.9562 4.6431 3.8035 3.8156 4.6909 6.0063 4.9183 7.7715 8.6795 5.7395 6.2671 6.9219 1.9389 3.4774 1.4957 5.6172 2.2331 1.3480 1.9846 1.6357 1.6444 2.7477 2.3470 1.5893 3.4512 2.5912 9.4061 6.2003 1.4249 6.2924 4.7578 1.3509 1.2512 5.4076 1.0564 1.0606 1.0478 1.0490 3.0351 8.8152 7.4777 9.7869 10.8198 1.0369 1.0374 1.0972 1.0953 1.1022 1.1011 1.0915 1.0920 1.0952
irintensity: 0.5349 4.4367 3.1095 0.2942 4.7108 0.6849 0.4314 1.2590 4.3754 0.2097 4.4241 0.8799 1.9767 1.9953 2.1524 1.2990 0.2976 4.7630 0.9502 6.1806 8.7258 13.8669 5.4746 2.8299 49.6050 2.8481 10.0334 3.9301 9.2995 7.1343 18.5286 23.4317 66.4336 167.0793 32.1193 37.9910 174.1766 5.6518 108.8631 7.9462 9.2239 40.3432 531.6280 203.5314 245.2082 215.9028 311.8838 15.1121 8.2821 52.6254 65.8096 48.5031 58.8514 22.3455 21.0030 26.5297 5.2245 39.3258 269.2967 21.2325 4.0928 187.6485 162.5632 0.2730 0.2771 4.5104 5.8535 8.3464 8.9339 1.1364 11.5506 7.2269
temp: 298.150 k
press: 1.00000 atm
elementType: 8 8 8 8 8 8 7 6 6 6 6 6 6 6 6 6 6 1 1 1 1 1 1 1 1 1
symmnumber: 1
zpe: 471058.3 jmol-1
zpe.correction: 0.179417 hartree
zpe.thermalcorrener: 0.196204 hartree
zpe.thermalcorrenthalpy: 0.197148 hartree
zpe.thermalcorrgfe: 0.132176 hartree
zpe.sumelectzpe: -891.234484 hartree
zpe.sumelectthermal: -891.217697 hartree
zpe.sumelectthermalent: -891.216752 hartree
zpe.sumelectthermalfe: -891.281725 hartree
dipole: -2.5787 -2.1422 -1.1985
dipole: 3.5603
quadrupole: -78.3375 -103.0106 -101.6035
quadrupole: -18.9032 -5.3985 0.9086
quadrupole: 15.9797 -8.6934 -7.2863 -18.9032 -5.3985 0.9086
hfenergy: -891.4139007 hartree
pointgroup: C01 [X(C10H9N1O6)]
dipole: -0.9602644 0.9331345 0.4112767 debye
dipolederiv: -2.044405 -0.2484935 0.4856331 0.0161945 -0.3193479 -0.1245234 0.4404856 -0.0851827 -0.5925072 -2.4447358 0.2954932 -0.1134063 0.4452719 -0.4825681 0.0168175 -0.1592774 0.013279 -0.1908975 -0.4948667 -0.0722692 -0.0333805 -0.0709618 -0.8886817 -0.0055897 -0.050518 -0.0159188 -0.2252309 -0.8586208 0.0185428 -0.1045633 0.059534 -0.4654871 0.0128463 -0.1097377 0.004344 -0.2251776 -0.604997 -0.0920928 -0.1679997 0.0979909 -0.2968033 -0.2144975 0.4116327 -0.044978 -0.8976215 -0.7488127 -0.0665115 -0.0289042 0.5666432 -0.914471 0.0059783 -0.017083 -0.0277255 -0.289517 1.27443 -0.2583612 0.1912638 -0.2482841 1.5284335 -0.0214917 0.1888671 0.0064071 0.2147228 -0.2311671 0.3870084 -0.0249868 0.2323039 -0.432375 0.0344316 -0.0864419 0.0276754 0.0604498 1.1473735 0.3004384 -0.1759282 0.0107167 0.3148333 -0.0906434 0.1615976 0.0374 0.0192323 1.5000232 0.0490511 0.074421 0.334437 -0.1942941 0.0481511 0.1303196 -0.0012567 0.0964849 -0.2381973 -0.2954241 0.0235655 0.1037391 -0.0160937 0.0171796 0.0047477 -0.0269772 -0.1006112 -0.4278058 -0.0187073 0.0593928 0.1943405 0.1123418 0.0183005 0.0274189 0.0193009 -0.1236544 -0.1116284 0.0623387 -0.0127079 -0.0958791 0.0599557 -0.0220209 -0.0048945 0.0059794 -0.1138209 2.0089693 0.2290677 -0.2054272 -0.3097931 0.3185985 0.3898046 -0.9472081 0.1022425 1.3974332 2.3165468 -0.126021 0.1234377 -1.0802975 1.2913716 -0.018028 0.1256274 0.0289187 0.2239351 -0.4219034 -0.0603345 -0.1154569 0.0365418 0.0123105 0.0064023 -0.2009178 -0.0223998 -0.0928677 -0.35165 -0.1544014 -0.028476 -0.2900138 -0.1633381 -0.0267449 -0.0350397 -0.018098 0.0079429 0.1401019 -0.0075567 0.0031762 -0.0606249 0.1098684 -0.005626 -0.013452 -0.0037691 0.1815493 0.0655294 -0.0478944 -0.0135983 -0.0454722 -0.0043983 -0.0017546 -0.0024958 -0.0011301 0.1582352 0.162169 0.0451695 0.0031321 0.0328052 0.1001792 0.0008127 -0.0038811 -0.0040299 0.1785574 0.1100216 0.0303946 0.0081627 -0.0360336 -0.0153321 -0.092815 0.0191352 -0.0816313 0.0925904 -0.0035187 -0.0228263 0.0611412 -0.0266174 0.1218414 -0.0162636 0.110362 0.0042548 -0.0054777 0.1300383 -0.0073206 -0.0105118 0.0197892 0.0312647 0.0788275 0.0088156 0.0768253 0.0815502 -0.0431972 0.0500562 -0.0113798 0.0947834 0.0320259 0.004495 -0.0114218 0.0006385 0.1320485 0.0872822 -0.0008888 -0.0284808 0.0020577 0.0745517 0.0880495 0.0084022 0.0933531 0.0085553 0.0830207 0.0115429 0.0418817 0.0168283 0.0856142 -0.0820978 0.0049573 -0.0875217 0.0040961 unknown
polarizability: 218.9439885|-4.0676194|143.545859|3.6986987|1.9856008|75.1650552 unknown
InChI: InChI=1S/C10H9NO6/c1-6(12)16-8-3-4-10(17-7(2)13)9(5-8)11(14)15/h3-5H,1-2H3
charge 0 multiplicity 1
26 atoms
O  2.411878 1.116814 0.447401
O  -3.054657 -0.253903 -0.02372
O  0.959407 -2.956973 0.220499
O  2.744662 -1.600628 0.591132
O  3.005821 0.318011 -1.681293
O  -4.124917 1.847727 -0.032683
N  1.490179 -1.787776 0.348415
C  0.596488 -0.607924 0.241406
C  1.063824 0.737878 0.295968
C  -1.706029 0.183481 0.090569
C  -0.783723 -0.876192 0.130115
C  0.115397 1.780027 0.262446
C  -1.26697 1.53021 0.166573
C  3.364261 0.747937 -0.577108
C  -4.185579 0.604903 -0.081704
C  4.753911 0.999016 -0.065166
C  -5.428533 -0.241941 -0.208366
H  -1.125462 -1.912598 0.082869
H  0.487148 2.807637 0.30897
H  -1.981462 2.352798 0.141084
H  4.799864 1.938323 0.508678
H  5.466583 1.018776 -0.902068
H  5.019738 0.173123 0.61949
H  -6.313004 0.408443 -0.260064
H  -5.514104 -0.923281 0.655749
H  -5.370319 -0.86959 -1.114291
