program: Gaussian 09
title: 000284713
version: EM64L-G09RevD.01
frameworkgroup: C1[X(C15H16N2O)]
method: RPBEPBE
basis: SDD
operation: Freq
keyword: #p
keyword: freq=noraman
keyword: PBEPBE/SDD
title: #p freq=noraman PBEPBE/SDD
converged: YES YES NO NO
title: Mulliken charges:
elementType: O N N C C C C C C C C C C C C C C C H H H H H H H H H H H H H H H H
charge: -0.385606 -0.112034 -0.347018 -0.063155 0.324047 0.342500 -0.421957 -0.425930 -0.242181 -0.830185 -0.817965 0.103945 0.262473 -0.363612 -0.345697 -0.230703 -0.238493 -0.230059 0.230588 0.230084 0.222195 0.221391 0.246104 0.247416 0.245751 0.221709 0.220882 0.267895 0.285719 0.229613 0.229565 0.334970 0.230819 0.356927
chargesum: 0.00000
title: Mulliken charges with hydrogens summed into heavy atoms:
elementType: O N N C C C C C C C C C C C C C C C
charge: -0.028678 -0.112034 -0.012048 -0.063155 0.324047 0.342500 -0.191369 -0.195846 -0.019986 -0.115274 -0.129622 0.103945 0.262473 -0.095717 -0.059978 -0.001090 -0.008928 0.000761
polarizability: 2.78208861e+02 1.29419601e+00 1.68016476e+02 3.34077218e+00 7.08313504e-01 1.17516471e+02
1716.lowfreq: -3.8422 -0.0008 -0.0001 0.0006 2.0443 4.2361 27.6930 42.7564 54.2804
frequency: 27.6870 42.7218 54.2486 64.6924 89.3500 119.5292 127.6486 138.8514 151.7553 179.9432 226.2028 229.6295 246.7893 277.4064 301.7297 316.2863 338.5626 406.4806 442.1813 465.3251 490.0150 504.2232 514.3205 530.3482 550.0133 574.0528 614.2508 635.6155 665.9154 680.2474 699.7840 724.9301 758.4270 773.4973 781.6407 821.3231 858.6307 897.8939 918.7203 940.8709 964.7425 984.2539 985.2903 990.4662 992.1823 1001.6425 1026.3032 1036.9295 1041.2230 1051.4155 1081.3792 1088.1501 1115.1952 1172.7582 1173.7686 1190.5020 1199.4239 1254.9026 1266.4699 1317.4266 1333.8104 1344.7880 1360.7586 1382.3276 1393.1178 1396.3384 1405.8182 1422.7108 1436.6857 1448.3962 1457.6267 1465.5822 1479.9871 1484.9872 1487.0970 1577.4864 1581.4287 1596.8604 1608.0384 1612.9215 2969.3490 2972.6024 3043.6080 3047.2739 3085.0812 3086.7126 3116.4968 3124.4614 3127.6960 3140.0526 3154.5895 3155.2777 3167.2183 3181.2458 3407.1181 3485.5386
redmass: 4.0186 4.3997 4.6608 4.6949 5.2427 3.7949 1.0755 3.5951 1.0767 3.9241 3.7225 2.6802 2.4386 1.6725 4.3552 3.1716 4.0512 2.8376 3.8081 4.3129 3.8991 2.8313 3.5851 2.6449 4.7186 2.0425 6.2648 5.4854 5.4306 4.8730 1.7283 5.1770 5.0519 1.2206 2.0287 5.0363 1.2451 1.3109 2.5262 1.4257 1.3316 1.7380 1.5560 5.8341 3.8240 1.3280 2.3902 1.7950 1.5375 1.5222 1.6688 1.8741 2.8065 1.0580 1.1656 1.1323 4.1053 1.6217 3.3595 1.2922 1.5099 2.4075 6.3295 4.5525 1.4947 1.2702 1.2585 2.3796 2.2837 1.7374 1.0809 1.0623 1.2280 1.9042 1.4562 6.5155 7.4789 6.1240 6.2366 6.0311 1.0381 1.0378 1.0951 1.0961 1.0994 1.0991 1.0856 1.0916 1.0853 1.0896 1.0989 1.0945 1.0977 1.0964 1.0686 1.0780
irintensity: 0.0830 0.2944 0.2536 0.6768 23.8880 6.4723 1.1609 2.2664 0.4587 2.7988 2.2676 3.3113 10.5837 128.8162 11.2389 4.3677 9.2436 0.1258 3.8377 12.2326 2.3293 5.6289 10.9003 39.0269 5.0601 38.4609 1.7238 31.3800 11.2643 5.2548 53.1926 5.3647 11.7558 61.6568 41.2127 8.4702 0.9995 0.0154 6.6698 4.0329 0.0950 9.0492 5.0083 4.7853 25.6201 0.7444 8.1486 0.5089 7.0804 3.7711 18.6909 38.2651 0.6107 0.8365 0.8849 4.9193 54.5146 0.2005 13.5171 3.5973 18.5715 102.5771 0.8426 1.6264 5.2435 12.7036 14.6373 9.1496 22.6267 1.2713 23.5674 17.6301 35.3536 14.7497 34.5246 178.7558 3.0194 127.3143 64.2739 10.5846 35.7199 21.7714 20.5438 14.0748 28.5546 24.5679 2.0393 29.2402 0.0212 15.2817 47.8785 20.3124 17.8470 6.0061 0.6688 18.6296
temp: 298.150 k
press: 1.00000 atm
elementType: 8 7 7 6 6 6 6 6 6 6 6 6 6 6 6 6 6 6 1 1 1 1 1 1 1 1 1 1 1 1 1 1 1 1
symmnumber: 1
zpe: 715709.3 jmol-1
zpe.correction: 0.272599 hartree
zpe.thermalcorrener: 0.290026 hartree
zpe.thermalcorrenthalpy: 0.290970 hartree
zpe.thermalcorrgfe: 0.226551 hartree
zpe.sumelectzpe: -764.577866 hartree
zpe.sumelectthermal: -764.560440 hartree
zpe.sumelectthermalent: -764.559496 hartree
zpe.sumelectthermalfe: -764.623915 hartree
dipole: -1.2519 0.5893 2.0417
dipole: 2.4664
quadrupole: -95.0790 -103.3052 -104.8464
quadrupole: -2.9443 1.7407 3.5037
quadrupole: 5.9979 -2.2283 -3.7695 -2.9443 1.7407 3.5037
hfenergy: -764.8504655 hartree
pointgroup: C01 [X(C15H16N2O1)]
dipole: -0.4972411 0.4854253 0.677273 debye
polarizability: 278.1184376|4.3172862|162.6090081|2.0657094|-15.757567|123.0143617 unknown
InChI: InChI=1S/C15H16N2O/c1-11-7-6-8-12(2)14(11)16-15(17-18)13-9-4-3-5-10-13/h3-10,17-18H,1-2H3
charge 0 multiplicity 1
34 atoms
O  -1.050813 -0.740269 2.761025
N  0.317554 0.218071 -0.531289
N  -0.191095 -0.693097 1.595819
C  1.725789 0.129332 -0.308914
C  2.401183 -1.12862 -0.423626
C  2.462845 1.337608 -0.097929
C  3.810651 -1.155191 -0.294142
C  3.869837 1.264148 0.02895
C  4.547143 0.027466 -0.061907
C  1.617679 -2.393262 -0.723882
C  1.73198 2.664109 -0.020754
C  -0.579721 -0.151619 0.359676
C  -2.034058 -0.032253 0.035611
C  -2.422712 0.92418 -0.939859
C  -3.021778 -0.86847 0.622656
C  -3.775414 1.055136 -1.312624
C  -4.374744 -0.739379 0.238384
C  -4.758199 0.224171 -0.722492
H  4.331908 -2.115899 -0.385874
H  4.43641 2.18866 0.194172
H  5.637732 -0.012316 0.033734
H  2.294871 -3.249012 -0.885454
H  0.923934 -2.658465 0.097165
H  0.995788 -2.26278 -1.629232
H  1.067904 2.794647 -0.895418
H  1.08428 2.728678 0.875426
H  2.442118 3.508007 0.015123
H  -1.643322 1.538982 -1.40068
H  -2.731607 -1.618436 1.362682
H  -4.064203 1.799275 -2.063012
H  -5.128989 -1.394393 0.688361
H  0.805395 -0.701411 1.841745
H  -5.810143 0.323649 -1.012917
H  -1.2755 0.205754 2.997374
