program: Gaussian 09
title: 000284788
version: EM64L-G09RevD.01
frameworkgroup: C1[X(C22H22N4O4S2)]
method: RPBEPBE
basis: SDD
operation: Freq
keyword: #p
keyword: freq=noraman
keyword: PBEPBE/SDD
title: #p freq=noraman PBEPBE/SDD
converged: YES YES NO NO
title: Mulliken charges:
elementType: S S O O O O N N N N C C C C C C C C C C C C C C C C C C C C C C H H H H H H H H H H H H H H H H H H H H H H
charge: 0.512783 0.905033 -0.565559 -0.541399 -0.250158 -0.242673 -0.615237 0.047308 -0.445156 -0.444971 -0.165527 -0.030384 -0.246996 -0.144385 -0.186404 -0.242534 -0.244575 0.502642 0.452026 -0.347505 -0.451469 -0.363452 -0.369305 -0.120025 0.495267 -0.351975 -0.461777 -0.802038 0.217830 0.216799 -0.798276 -0.795462 0.312154 0.267838 0.279890 0.277604 0.315643 0.227639 0.325331 0.239644 0.238379 0.241089 0.322544 0.241010 0.227330 0.228696 0.313055 0.314875 0.238523 0.271358 0.239145 0.240628 0.272946 0.242231
chargesum: 0.00000
title: Mulliken charges with hydrogens summed into heavy atoms:
elementType: S S O O O O N N N N C C C C C C C C C C C C C C C C C C C C C C
charge: 0.512783 0.905033 -0.565559 -0.541399 -0.250158 -0.242673 -0.615237 0.047308 -0.132101 -0.130096 -0.165527 -0.030384 -0.246996 0.167769 0.081434 0.037356 0.033030 0.502642 0.452026 -0.031862 -0.223830 -0.123808 -0.130926 0.205306 0.495267 -0.110886 -0.139233 -0.105002 0.217830 0.216799 -0.049250 -0.039657
polarizability: 4.58864659e+02 9.55640799e+00 3.90292863e+02 2.29439049e+01 -1.64359481e+01 2.42465458e+02
1716.lowfreq: -63.5689 -55.1901 -10.5953 -2.1131 -0.0019 -0.0017 -0.0014 0.7868 3.8766
frequency: -63.5666 -55.1897 -9.0808 4.3874 15.2645 19.8155 22.8874 28.2821 35.4782 46.9459 52.6031 64.6067 72.6620 75.3758 78.3454 106.2771 113.5809 120.0316 133.5512 141.8469 152.8344 165.4403 183.9838 220.4133 226.1691 246.7822 273.3416 278.6378 301.0062 314.0101 320.7128 328.5889 353.6189 360.3144 370.8924 380.2077 388.1548 403.9002 406.9872 412.0116 423.8750 427.9483 474.3778 501.7299 516.0435 529.8618 550.0568 557.0269 572.0753 583.5521 586.8165 593.4328 609.7956 621.8333 622.6138 641.4919 645.1832 648.5954 677.3030 685.7647 709.7231 719.8904 750.1494 774.7200 794.1513 815.2557 817.1675 820.0154 827.8217 848.8735 852.3755 879.1485 908.2088 929.4663 930.0363 937.1503 945.5926 960.3157 970.8977 978.7028 980.8381 984.2522 988.4425 992.0860 997.1749 997.9015 1006.4003 1032.3435 1033.6648 1048.6939 1052.5762 1057.0407 1073.6284 1115.5631 1122.2108 1164.0874 1181.2612 1189.5047 1216.9869 1217.7556 1220.4891 1257.9137 1264.9603 1279.9567 1293.2669 1298.2558 1338.4331 1350.8559 1369.4642 1378.2434 1379.6630 1381.4307 1390.4779 1397.1403 1403.7791 1444.8100 1447.8266 1457.2550 1468.0938 1468.5663 1471.1725 1473.4312 1473.6439 1480.0623 1492.4568 1504.7903 1565.7653 1574.4899 1594.5392 1596.5547 1597.5310 1602.9678 1638.5764 1640.1781 2978.6583 2988.4854 2989.7873 3061.0361 3073.4726 3074.6796 3090.2041 3099.3389 3123.3661 3129.7443 3131.9293 3133.7389 3137.6938 3138.8594 3146.6060 3161.1859 3164.3652 3180.6917 3197.6479 3206.1990 3513.9043 3522.8679
redmass: 1.0617 1.0560 1.5270 2.0234 6.2338 5.0751 3.9396 4.6175 4.9747 7.6293 5.0403 5.6658 5.0495 5.2498 5.1808 6.1761 9.5825 5.0419 6.4249 5.0842 8.2087 5.4963 5.5439 8.1795 6.8113 8.1450 6.2649 5.7458 5.5264 6.2607 4.9371 5.1151 4.6721 6.1105 5.1020 4.4665 6.2907 4.1112 2.8835 3.1594 5.7411 6.5583 7.0270 3.4716 2.9176 3.0998 4.5105 5.0004 9.2286 2.9753 2.9906 6.2918 8.2842 7.2507 6.9742 12.8618 1.1900 1.2105 6.2573 6.2150 3.2759 3.3422 4.4122 5.7529 8.5583 1.8363 2.8576 4.7393 1.4281 1.2534 1.5069 1.3740 16.2301 6.1838 6.7002 1.4182 1.3801 1.3109 1.6117 1.4058 1.6348 1.9298 1.3976 3.4378 5.0842 2.6077 1.3057 1.6645 1.6689 1.5899 2.6123 2.5111 3.5391 1.2798 1.3172 1.3531 1.1440 1.1281 3.0094 3.4690 3.1513 1.9891 1.9864 1.5646 1.2657 1.3599 5.2639 2.9613 4.1826 1.2644 1.2398 6.0662 3.0446 1.2232 4.5225 1.2032 1.1283 2.0507 1.0468 1.0466 1.1013 1.5856 1.3630 2.2364 2.1012 2.0869 4.1536 5.6792 5.9740 6.9283 6.1373 5.7405 5.1318 5.3577 1.0389 1.0385 1.0386 1.0947 1.0983 1.0983 1.0999 1.0960 1.0906 1.0950 1.0893 1.0894 1.0979 1.0980 1.0916 1.0952 1.0963 1.0951 1.0945 1.0942 1.0766 1.0764
irintensity: 0.0011 0.0176 0.0605 1.7010 0.5691 0.8206 0.1317 12.3802 5.9820 3.4364 2.8128 0.1310 4.4291 2.8121 0.6739 3.3664 0.2053 3.8853 2.5750 0.4094 7.9763 2.8938 4.2335 10.7839 1.7935 3.3402 15.7599 9.6914 6.3918 4.6305 10.8731 0.8679 2.4111 3.7393 18.4249 9.5636 14.9072 8.0005 0.3300 0.4343 3.0951 25.7602 58.3715 65.1033 17.9764 25.4041 16.0072 5.7588 53.3529 1.0666 2.1151 30.4727 24.7129 13.4209 0.9336 195.7435 50.6875 70.3888 7.8240 6.9173 0.7800 0.6358 2.0567 27.9470 85.9090 27.2013 17.6614 14.7679 22.8254 0.8352 55.3894 44.8116 90.2083 8.1172 6.2302 3.3638 16.1586 0.6036 15.8412 0.3988 18.0231 11.8756 1.0481 36.1564 5.1046 10.5867 1.4775 7.8300 8.1840 27.9303 8.4927 27.8142 19.5555 7.6016 6.8969 38.2555 20.2242 52.3793 7.5438 67.2282 75.8683 39.8108 53.6195 3.5129 2.1898 23.5938 11.7630 244.2150 202.0285 86.8587 61.8475 0.3430 8.4302 14.2219 28.0889 31.3600 45.3691 328.4394 19.4734 20.2526 15.9176 17.5911 21.3290 89.5636 419.7400 436.5012 39.7819 31.8394 45.0502 1.6165 8.5360 48.5214 114.0246 125.5237 33.1651 7.8298 6.0606 18.9968 13.6099 12.2594 15.7051 83.4486 19.2226 33.3887 16.7235 12.2547 6.6138 6.1926 13.1535 1.8003 10.6711 0.8597 7.1164 1.9778 12.3272 13.6292
temp: 298.150 k
press: 1.00000 atm
elementType: 16 16 8 8 8 8 7 7 7 7 6 6 6 6 6 6 6 6 6 6 6 6 6 6 6 6 6 6 6 6 6 6 1 1 1 1 1 1 1 1 1 1 1 1 1 1 1 1 1 1 1 1 1 1
symmnumber: 1
zpe: 1050039.5 jmol-1
zpe.correction: 0.399939 hartree
zpe.thermalcorrener: 0.430669 hartree
zpe.thermalcorrenthalpy: 0.431613 hartree
zpe.thermalcorrgfe: 0.331566 hartree
zpe.sumelectzpe: -2165.045504 hartree
zpe.sumelectthermal: -2165.014774 hartree
zpe.sumelectthermalent: -2165.013830 hartree
zpe.sumelectthermalfe: -2165.113877 hartree
dipole: -4.6532 2.2425 4.8831
dipole: 7.1081
quadrupole: -171.0688 -161.9221 -206.5326
quadrupole: 10.1431 3.1825 -37.5679
quadrupole: 8.7724 17.9191 -26.6914 10.1431 3.1825 -37.5679
hfenergy: -2165.4454427 hartree
pointgroup: C01 [X(C22H22N4O4S2)]
dipole: 1.1513039 1.4426003 2.1009597 debye
polarizability: 395.1754969|15.8087297|457.4265784|-1.6010555|-14.3504208|239.0209041 unknown
InChI: InChI=1S/C22H22N4O4S2/c1-15-4-11-21(12-5-15)32(29,30)26-31(20-9-6-18(7-10-20)24-16(2)27)22-13-8-19(14-23-22)25-17(3)28/h4-14,24-25H,1-3H3
charge 0 multiplicity 1
54 atoms
S  -0.025925 0.315996 -1.5919
S  -2.542156 -1.302134 -1.568798
O  -3.710181 -0.186016 -1.253505
O  -2.277962 -1.728877 -3.12547
O  5.144728 -2.583646 2.248717
O  0.634958 6.939266 0.491932
N  -0.993778 -0.873262 -0.617873
N  0.510305 2.955786 -0.84694
N  5.493982 -0.83234 0.721878
N  -1.351331 5.737294 0.826591
C  1.655554 -0.028653 -0.838618
C  -2.958318 -2.846447 -0.573632
C  -0.438165 2.015406 -0.77965
C  1.777928 -1.048927 0.119259
C  2.760705 0.720582 -1.286471
C  -2.44018 -4.07534 -1.011318
C  -3.795678 -2.718131 0.544338
C  4.181895 -0.598132 0.22794
C  -3.616819 -5.157395 0.868132
C  3.047656 -1.340961 0.65838
C  4.026367 0.42919 -0.744066
C  -2.778896 -5.232593 -0.276635
C  -4.118872 -3.889814 1.264637
C  -1.727292 2.181911 -0.242373
C  -1.018745 4.477517 0.269884
C  -2.008432 3.453551 0.292191
C  0.245876 4.186783 -0.322601
C  -3.996466 -6.413841 1.631213
C  5.92137 -1.770967 1.671434
C  -0.552056 6.888109 0.919136
C  7.424239 -1.720618 1.94627
C  -1.253746 8.070634 1.583011
H  0.886102 -1.605732 0.426295
H  2.643098 1.521537 -2.020226
H  -1.809735 -4.122151 -1.905035
H  -4.192585 -1.737046 0.82361
H  3.172605 -2.128886 1.402462
H  4.896769 1.006122 -1.080541
H  -2.469564 1.373535 -0.263786
H  -2.387102 -6.205436 -0.595743
H  -4.768639 -3.818178 2.144659
H  -2.999623 3.651115 0.718858
H  1.028333 4.943864 -0.373994
H  -4.907967 -6.87407 1.202717
H  -4.206703 -6.196401 2.692823
H  -3.19536 -7.172179 1.58804
H  6.222538 -0.230513 0.329669
H  -2.298703 5.814423 1.206752
H  7.730692 -0.729345 2.328978
H  7.667113 -2.481077 2.701778
H  8.007629 -1.931324 1.030722
H  -1.567255 7.826123 2.614829
H  -0.554219 8.917591 1.618202
H  -2.151388 8.3759 1.013942
