program: Gaussian 09
title: 000284691
version: EM64L-G09RevD.01
frameworkgroup: C1[X(C9H12O4)]
method: RPBEPBE
basis: SDD
operation: Freq
keyword: #pfreq=noraman
keyword: PBEPBE/SDD
title: #p freq=noraman PBEPBE/SDD
converged: YES YES NO NO
title: Mulliken charges:
elementType: O O O O C C C C C C C C C H H H H H H H H H H H H
charge: -0.299516 -0.224563 -0.422917 -0.223910 -0.226986 -0.032082 0.194020 -0.124748 -0.690686 -0.293478 -0.126863 0.137751 -0.693318 0.258363 0.229737 0.231987 0.237445 0.225533 0.232177 0.263022 0.292104 0.226155 0.227685 0.253448 0.349638
chargesum: 0.00000
title: Mulliken charges with hydrogens summed into heavy atoms:
elementType: O O O O C C C C C C C C C
charge: -0.299516 -0.224563 -0.073278 -0.223910 0.031377 0.197655 0.194020 0.107239 0.004471 -0.001374 0.136159 0.137751 0.013970
polarizability: 1.34599462e+02 1.33604946e+01 1.02222308e+02 -2.22794725e+00 -5.58091382e+00 8.91529401e+01
1716.lowfreq: -20.8017 -3.9606 0.0008 0.0009 0.0010 10.8823 39.7445 54.6450 88.8781
frequency: 39.1023 54.5324 88.8450 122.9532 133.1270 165.6732 194.6400 208.7093 225.9719 279.6539 306.4985 324.4836 355.6737 387.8311 418.8231 462.6060 471.2994 522.6532 539.9987 561.4266 698.8661 703.6857 739.3161 789.0401 808.7948 834.1505 876.7380 912.5900 921.7215 960.4175 1000.8952 1012.8557 1021.7892 1041.4992 1055.2860 1110.4394 1118.4967 1136.1679 1146.4334 1186.8596 1217.5340 1232.4248 1283.7258 1306.4640 1315.9807 1339.5088 1353.3435 1366.2522 1392.4235 1395.3916 1416.0265 1460.4590 1467.5122 1470.9490 1475.9515 1616.5795 1654.8027 2988.4373 2993.7231 3057.5006 3066.7794 3079.6160 3081.0163 3092.0990 3103.9273 3107.3976 3111.9799 3147.1020 3543.1101
redmass: 4.1431 4.0873 5.5972 4.3573 3.6390 2.2887 1.4661 1.6109 1.5531 3.5461 3.6151 2.2167 1.7653 3.4049 4.0344 5.4980 5.2576 6.3901 4.8270 4.2887 5.4333 5.5625 5.2451 3.1067 4.4554 2.7830 4.0050 1.5870 2.6123 3.0256 1.7365 1.4649 1.7799 1.4741 3.4488 2.2323 1.4950 1.9463 1.5395 2.6121 1.3994 1.4416 1.4880 1.4359 1.5582 1.7347 1.4297 1.1760 1.2100 1.2604 2.5399 1.0934 1.0515 1.0634 1.0502 11.3036 8.8178 1.0363 1.0363 1.0850 1.0891 1.0949 1.0952 1.0976 1.0982 1.0999 1.0890 1.0925 1.0664
irintensity: 2.0542 4.2170 3.5835 2.0111 7.8894 0.4083 0.5658 0.1677 1.2404 2.4189 0.4115 29.0761 95.4615 11.2888 7.7954 2.5891 6.1087 2.6295 1.5549 6.5939 13.4742 18.0708 3.7566 4.2770 40.9134 6.3810 25.7940 6.5788 98.5524 46.9060 11.7113 14.1741 51.2213 32.2233 142.2749 14.8790 1.2503 8.5521 12.5011 19.9100 55.6682 3.4756 10.9156 2.0174 3.8543 13.0323 25.3319 26.3297 28.8124 12.8260 30.8411 11.6683 9.2201 13.0201 4.6107 219.0828 58.1177 17.4724 11.9386 15.0850 2.0468 7.4580 17.6813 31.0168 22.2831 18.5484 16.4290 0.3982 14.6154
temp: 298.150 k
press: 1.00000 atm
elementType: 8 8 8 8 6 6 6 6 6 6 6 6 6 1 1 1 1 1 1 1 1 1 1 1 1
symmnumber: 1
zpe: 514864.1 jmol-1
zpe.correction: 0.196101 hartree
zpe.thermalcorrener: 0.209462 hartree
zpe.thermalcorrenthalpy: 0.210406 hartree
zpe.thermalcorrgfe: 0.155945 hartree
zpe.sumelectzpe: -649.992617 hartree
zpe.sumelectthermal: -649.979257 hartree
zpe.sumelectthermalent: -649.978313 hartree
zpe.sumelectthermalfe: -650.032773 hartree
dipole: 0.3106 -0.7679 3.5454
dipole: 3.6409
quadrupole: -71.8864 -92.2414 -71.8940
quadrupole: 2.5438 -1.1964 2.5898
quadrupole: 6.7875 -13.5675 6.7800 2.5438 -1.1964 2.5898
hfenergy: -650.1887187 hartree
pointgroup: C01 [X(C9H12O4)]
dipole: -0.2057564 -0.1720765 -1.4070971 debye
dipolederiv: -0.5920758 -0.0100271 0.0107961 -0.1296292 -0.5830717 0.1077755 0.024796 0.0919555 -0.300917 -1.1587523 0.0224624 0.4938318 -0.0502009 -0.446577 -0.0527236 0.2580255 -0.048339 -0.5396866 -0.7271158 0.0902314 -0.1280885 -0.0658168 -0.5165906 0.260574 -0.2370747 0.3046251 -0.4572745 -0.720468 0.077014 0.2043391 0.2426462 -0.752361 -0.3148838 0.2730957 -0.2529446 -0.5653763 0.0569695 0.0576401 -0.0460851 0.1502426 0.1507679 0.0274594 -0.2293786 -0.0363466 0.2099742 0.5582134 -0.1270134 -0.0071951 -0.0766421 0.2684423 -0.0966097 0.166762 -0.0450185 0.270249 0.2813067 -0.0492332 0.0052167 -0.0170097 -0.3819398 -0.1138082 -0.0918461 -0.1056265 -0.1256218 0.4702231 -0.1901548 0.0587015 0.0223201 0.2905809 -0.2102954 0.1220075 -0.1172502 0.4585066 -0.1977519 0.105484 0.0215145 0.0194564 0.0289288 0.0111383 -0.0485508 0.0122454 0.0184378 -0.1426023 -0.0481776 -0.0712142 0.0203054 0.0898144 0.1238246 0.0953977 0.0740015 -0.1889147 0.3732496 -0.03343 -0.1718297 -0.1367054 0.2236974 0.1567335 -0.2508109 0.0068941 0.5018162 1.3950137 0.0454971 -0.5563386 -0.071873 1.0788812 0.3707587 -0.4209145 0.3747899 0.5698057 0.0223564 0.0049269 -0.0085973 0.0339328 -0.0351534 0.0808786 0.0206492 0.0478357 -0.1476662 0.0149875 -0.00503 0.0301426 -0.0204643 0.0693731 -0.0653887 0.0570396 -0.0593573 0.0122005 -0.0116586 0.037507 0.0912274 0.0535851 0.0596851 0.0076765 0.0571935 0.0335955 -0.10335 0.0066997 0.0434752 0.0326818 0.055172 0.0317898 -0.0748183 0.02687 -0.0384257 -0.0663218 0.0818757 0.0118141 0.0067128 0.005271 0.1056637 0.0131967 0.0841283 -0.0032405 -0.1017515 0.0698331 -0.0028956 -0.0079899 0.0469858 -0.0993183 0.0796993 0.0073341 0.0714938 0.0850491 -0.0787539 -0.037126 -0.0803878 -0.0831279 0.0351942 -0.0746165 -0.0766705 -0.0784751 0.0430376 -0.0967467 -0.0018935 -0.0024975 0.0010373 0.0672028 -0.0165158 -0.0278038 -0.0050716 0.0249916 0.0788384 -0.0636832 0.0114138 -0.0677103 0.0399096 -0.0284077 -0.0018992 -0.0360032 0.1165598 0.0380021 0.0598645 0.0832411 0.0848037 0.0432081 -0.0885772 0.0970622 -0.0512761 -0.0313158 -0.1140812 -0.0075611 -0.070504 -0.0213929 0.081861 -0.0099424 -0.0275404 -0.0008184 0.0751164 0.0880621 -0.0468082 0.0001741 -0.0697056 -0.0915713 0.0473266 -0.0163746 -0.0000473 0.0824089 0.3043753 0.0671169 0.1007342 0.0745199 0.2415825 -0.1404545 0.1385027 -0.139196 0.1600428 unknown
polarizability: 134.5086115|-11.9606754|100.5386889|-6.3382609|7.3836814|90.9274096 unknown
InChI: InChI=1S/C9H12O4/c1-4-7(10)3-6(9(11)13-4)8-5(2)12-8/h3-5,7-8,10H,1-2H3
charge 0 multiplicity 1
25 atoms
O  -2.357561 -1.570993 0.357093
O  1.82781 1.200333 0.523995
O  2.701065 -1.863718 0.712904
O  -0.103344 1.966671 1.488226
C  -1.689049 -0.258053 0.675198
C  -2.711416 -0.323438 -0.433048
C  -0.223593 -0.190011 0.392641
C  1.969218 -1.152531 -0.361116
C  -4.115333 0.207935 -0.261692
C  0.478568 -1.23924 -0.130209
C  2.440935 0.306091 -0.521788
C  0.462553 1.070339 0.821733
C  2.163288 0.900805 -1.909631
H  -2.009576 0.202678 1.618093
H  -2.31663 -0.358475 -1.458942
H  2.261224 -1.712089 -1.266242
H  -4.42004 0.171537 0.797976
H  -4.175343 1.256382 -0.608323
H  -4.834515 -0.391263 -0.848439
H  3.516894 0.355483 -0.284461
H  -0.038315 -2.185265 -0.327911
H  2.756841 0.371125 -2.676836
H  1.095837 0.824528 -2.182055
H  2.452594 1.964571 -1.923108
H  2.408992 -1.503606 1.590542
