program: Gaussian 09
title: 000284702
version: EM64L-G09RevD.01
frameworkgroup: C1[X(C12H14N4O5)]
method: RPBEPBE
basis: SDD
operation: Freq
keyword: #p
keyword: freq=noraman
keyword: PBEPBE/SDD
title: #p freq=noraman PBEPBE/SDD
converged: YES YES NO NO
title: Mulliken charges:
elementType: O O O O O N N N N C C C C C C C C C C C C H H H H H H H H H H H H H H
charge: -0.257240 -0.451576 -0.486793 -0.484657 -0.281229 -0.158515 -0.042480 -0.009614 -0.638325 -0.116998 -0.157838 -0.149228 -0.037498 -0.402378 0.101917 -0.332873 0.156914 0.150721 -0.378396 0.146471 -0.370546 0.279134 0.264990 0.260130 0.240119 0.262407 0.238520 0.328331 0.354241 0.396186 0.365112 0.300960 0.248146 0.326725 0.335159
chargesum: 0.00000
title: Mulliken charges with hydrogens summed into heavy atoms:
elementType: O O O O O N N N N C C C C C C C C C C C C
charge: -0.257240 -0.097335 -0.090607 -0.119544 -0.281229 -0.158515 -0.042480 -0.009614 0.023559 0.162136 0.107152 0.110902 0.202621 0.098549 0.101917 -0.004541 0.156914 0.150721 -0.077436 0.146471 -0.122400
polarizability: 2.22994017e+02 9.49179498e+00 1.92979787e+02 7.96340349e+00 7.62506034e+00 1.02501818e+02
1716.lowfreq: -11.1638 -7.6313 0.0009 0.0010 0.0010 4.9998 21.0470 32.9324 44.7203
frequency: 20.9926 32.8599 44.6793 65.4324 87.3685 101.5073 125.7933 129.8152 145.8522 191.0624 213.2241 221.5875 241.7427 259.3908 284.2747 297.5786 302.1884 336.1309 349.9510 378.7478 397.3461 410.8620 444.2563 457.0530 467.0055 543.1788 569.7944 572.2793 583.7550 599.7794 615.3456 628.5093 694.1092 706.9383 726.4332 736.2658 744.5872 764.0413 801.6404 809.9919 836.5608 877.5392 904.3758 907.5539 918.9600 937.7157 939.2479 959.3142 962.0529 997.0862 1000.7672 1028.8352 1041.3856 1048.6600 1077.8884 1096.0675 1111.2888 1150.4185 1165.1123 1176.3363 1203.6023 1221.1050 1257.9918 1265.7692 1273.5070 1275.9202 1294.8297 1304.8493 1309.9370 1314.6255 1326.9854 1343.4225 1349.1974 1356.1031 1364.1263 1399.8928 1412.9643 1421.8003 1432.6781 1469.5748 1519.4825 1527.7501 1567.5105 1589.0013 1627.5616 3001.4095 3028.2427 3032.5301 3035.0817 3040.5806 3121.5502 3161.2840 3170.2222 3177.2622 3381.6821 3526.3522 3574.0634 3597.9064 3680.6877
redmass: 5.9693 6.0612 5.1204 6.9548 5.0220 3.6657 4.8374 4.4489 6.9709 6.8806 6.4611 7.7494 4.5209 3.3543 1.8466 1.6974 1.6786 3.9991 4.0135 3.8759 6.3134 4.8234 4.7235 6.4997 1.2590 1.3922 5.4000 4.1417 4.0338 6.4195 4.5014 3.1699 6.3431 2.8986 1.5048 5.2645 3.4346 6.9919 5.9067 4.1257 5.2363 4.7625 1.3983 1.4662 2.9982 5.7578 2.6931 1.4787 3.5360 5.0258 3.1236 3.3906 2.1230 1.9647 3.8826 1.9814 2.4588 1.4802 1.3619 4.0821 1.2687 1.5587 1.9678 1.9834 1.4339 1.9829 1.7996 1.4748 1.3287 1.3314 1.3848 3.3477 1.4268 1.2908 2.1885 1.5855 1.6805 2.1919 5.5149 1.0759 4.9540 8.7138 5.1916 3.1457 1.7375 1.0853 1.0861 1.0663 1.0834 1.0885 1.1040 1.1015 1.0912 1.0957 1.0654 1.0447 1.0666 1.0670 1.1044
irintensity: 0.7157 0.2444 13.1852 0.0853 11.9596 5.0155 1.4279 7.5096 4.1672 5.2348 1.9332 5.1718 1.3422 40.2161 82.5731 104.8114 63.9249 11.8852 27.5897 17.4900 2.8925 1.4586 0.3841 10.8023 117.3597 142.4169 13.6421 5.2405 7.4603 27.1621 7.9641 8.5377 23.3999 9.3718 64.5360 0.3336 140.4001 7.7686 3.2192 41.5793 23.2631 36.2263 50.0654 2.7157 43.1015 109.4730 89.6361 3.1543 29.0423 78.7143 59.5608 159.3309 2.6278 8.7253 3.4110 2.0009 60.3586 21.7570 49.7078 69.9313 3.3896 182.0969 6.9425 5.8186 7.9143 25.8056 63.3658 36.5614 8.5540 9.2207 19.3012 15.6170 61.4486 9.7059 14.5958 8.2000 32.7561 12.6592 275.4659 8.7459 47.6107 50.3261 9.3134 210.7836 211.3073 25.3534 31.1329 36.1470 10.1556 32.8029 18.4015 94.5721 16.5864 0.7914 152.2705 40.5509 16.0084 19.7420 32.0066
temp: 298.150 k
press: 1.00000 atm
elementType: 8 8 8 8 8 7 7 7 7 6 6 6 6 6 6 6 6 6 6 6 6 1 1 1 1 1 1 1 1 1 1 1 1 1 1
symmnumber: 1
zpe: 695027.7 jmol-1
zpe.correction: 0.264722 hartree
zpe.thermalcorrener: 0.283759 hartree
zpe.thermalcorrenthalpy: 0.284703 hartree
zpe.thermalcorrgfe: 0.216252 hartree
zpe.sumelectzpe: -1059.230659 hartree
zpe.sumelectthermal: -1059.211622 hartree
zpe.sumelectthermalent: -1059.210678 hartree
zpe.sumelectthermalfe: -1059.279130 hartree
dipole: 9.0698 0.9218 1.3629
dipole: 9.2179
quadrupole: -130.3857 -117.0837 -120.8282
quadrupole: 4.2343 -10.1332 -2.4073
quadrupole: -7.6198 5.6821 1.9377 4.2343 -10.1332 -2.4073
hfenergy: -1059.4953813 hartree
pointgroup: C01 [X(C12H14N4O5)]
dipole: 3.5519119 -0.2681568 -0.6812577 debye
polarizability: 222.4642057|-7.6124298|189.3111164|-12.5868361|19.3742729|106.7003005 unknown
InChI: InChI=1S/C12H14N4O5/c13-10(20)6-2-16(11-5(6)1-14-4-15-11)12-9(19)8(18)7(3-17)21-12/h1-2,4,7-9,12,17-19H,3,13H2
charge 0 multiplicity 1
35 atoms
O  1.997437 0.839043 1.102596
O  2.833498 2.348119 -1.573025
O  2.724961 -1.263519 -1.241546
O  4.526812 -1.869714 0.697688
O  -3.425123 -2.755547 -0.335645
N  -0.061893 0.497966 -0.129194
N  -1.583514 2.2928 0.585145
N  -3.925462 1.593311 0.797062
N  -1.386133 -3.541156 -1.117221
C  1.184257 1.262401 -0.055251
C  2.099392 1.107353 -1.308147
C  3.179464 0.087288 -0.896901
C  3.307586 0.307231 0.636784
C  3.575329 -0.992981 1.424816
C  -1.31925 1.015311 0.219977
C  -0.220509 -0.85636 -0.45809
C  -2.28304 -0.040609 0.101692
C  -1.565757 -1.224513 -0.336695
C  -3.618436 0.31576 0.414102
C  -2.1959 -2.544034 -0.589152
C  -2.904722 2.50991 0.861114
H  0.87654 2.310325 0.115358
H  1.532183 0.766107 -2.194261
H  4.121571 0.326416 -1.422467
H  4.076756 1.079715 0.832498
H  2.641311 -1.570283 1.490518
H  3.936736 -0.781407 2.446689
H  0.665562 -1.423219 -0.752824
H  2.200275 3.065498 -1.827947
H  3.421839 -1.879986 -0.870891
H  5.458304 -1.576551 0.848344
H  -4.432466 -0.411514 0.360958
H  -3.1795 3.523321 1.166436
H  -0.413894 -3.389224 -1.377656
H  -1.809017 -4.452659 -1.286465
