program: Gaussian 09
title: 000284684
version: EM64L-G09RevD.01
frameworkgroup: C1[X(C14H18Br2N2)]
method: RPBEPBE
basis: SDD
operation: Freq
keyword: #p
keyword: freq=noraman
keyword: PBEPBE/SDD
title: #p freq=noraman PBEPBE/SDD
converged: YES YES NO NO
title: Mulliken charges:
elementType: Br Br N N C C C C C C C C C C C C C C H H H H H H H H H H H H H H H H H H
charge: -0.099086 -0.006413 -0.100635 -0.016494 -0.373983 -0.384146 -0.378588 -0.398560 -0.418479 -0.360567 0.140710 0.349808 -0.856285 -0.350777 -0.362651 -0.208493 -0.191405 -0.210758 0.211612 0.191340 0.208535 0.205677 0.199514 0.221196 0.209974 0.222376 0.271766 0.223440 0.205791 0.243169 0.303126 0.295126 0.252134 0.267856 0.248797 0.245372
chargesum: 0.00000
title: Mulliken charges with hydrogens summed into heavy atoms:
elementType: Br Br N N C C C C C C C C C C C C C C
charge: -0.099086 -0.006413 -0.100635 -0.016494 0.028969 0.030066 0.042122 0.033790 0.076727 0.088394 0.140710 0.349808 -0.258033 -0.098643 -0.094795 0.040304 0.053968 -0.210758
polarizability: 3.32023158e+02 -1.23295342e+01 2.25434912e+02 -1.14298869e+01 1.08068105e+01 1.18458419e+02
1716.lowfreq: -6.0872 -0.0003 -0.0003 -0.0002 1.8438 6.8271 16.0317 42.1195 42.9829
frequency: 15.5327 42.0970 42.9811 58.2197 63.3729 73.2457 106.3672 128.3881 152.3324 175.5738 214.5469 235.1309 278.6446 296.7783 315.5240 339.8056 354.8878 375.9813 381.0590 404.1337 409.7338 463.8043 486.2694 506.8950 519.0921 561.1580 623.1226 645.9563 663.3701 718.1843 731.4408 739.1759 762.3253 778.1065 826.7403 842.9230 850.9512 857.6952 882.4851 896.0698 954.9361 959.6146 965.6204 981.0626 990.0507 1004.5581 1025.9666 1053.2564 1063.3925 1087.1175 1103.7085 1113.9240 1127.2188 1156.8436 1164.9053 1178.8280 1182.7834 1193.8268 1231.9972 1240.3431 1262.5615 1279.9244 1297.5365 1301.7510 1328.6021 1333.9180 1341.3321 1345.7695 1349.7645 1358.0852 1360.9640 1378.1687 1394.0413 1453.4600 1455.2228 1461.0014 1464.8255 1472.5503 1476.6463 1478.2765 1491.5487 1528.2778 1570.4681 1593.2125 2968.1897 2971.1004 2976.5651 2983.9353 2987.0352 3008.2599 3024.7795 3032.8235 3034.8057 3048.8517 3077.9786 3083.1143 3094.9706 3144.4531 3155.1407 3170.1602 3176.6740 3179.2892
redmass: 4.3744 4.4002 7.7568 8.1601 4.4134 5.4028 3.0295 5.2521 2.8176 7.8208 5.8089 3.5506 3.1742 3.0041 3.4368 3.2957 4.9115 3.8593 2.7380 5.3675 2.9477 2.5426 3.6213 2.2334 2.5417 3.0528 6.9075 5.5005 3.4348 3.4740 1.8087 1.9671 3.4445 2.6498 1.3117 1.5188 2.2548 1.6197 2.1465 1.8442 1.3759 2.0712 1.9422 1.3881 4.1667 2.3439 1.7698 2.0698 2.4676 1.9750 1.4761 1.6442 1.9874 1.6446 2.7452 1.2131 1.1396 1.1518 1.4889 1.3471 1.3682 1.3032 1.2730 2.0932 1.2676 1.4524 1.5299 1.3953 1.6732 1.7454 1.5721 2.0752 3.5357 1.1055 1.1008 1.2319 1.0850 1.1751 1.6877 1.1529 1.2811 3.4868 7.4495 6.0803 1.0606 1.0646 1.0599 1.0641 1.0680 1.0629 1.0986 1.0971 1.0991 1.1011 1.0982 1.1032 1.0592 1.0886 1.0881 1.0957 1.0965 1.1075
irintensity: 0.2278 0.3194 0.2562 0.1520 0.5646 0.8617 2.3755 1.6779 0.1296 4.9677 4.5949 2.0997 4.5582 6.0324 1.4834 0.3664 33.8959 12.4323 6.6062 47.6509 0.9963 0.7917 40.3291 9.2627 9.1047 13.9839 2.4349 29.9845 8.1737 3.6785 9.3730 4.1821 32.9347 4.4404 12.9372 53.7288 2.4205 17.8859 45.7889 23.7678 1.2558 2.5441 26.8704 3.6434 62.6132 33.8242 31.9935 1.1375 34.7955 5.9598 20.6061 0.7716 3.2543 25.0062 1.6357 28.6696 72.6204 4.1546 17.1862 0.5807 3.7081 8.3558 2.3574 3.8615 3.9029 8.3373 3.6990 2.3470 10.4002 25.2378 30.3324 17.3703 13.1738 12.3795 11.7003 88.6293 12.3548 15.4003 44.3693 35.2126 97.1278 284.2808 8.0557 5.7587 22.6890 30.5826 19.4889 32.6410 19.3217 58.7897 43.9443 47.6857 66.6288 104.4373 6.3481 18.4244 8.1432 5.8916 1.8689 8.4519 3.1404 2.3950
temp: 298.150 k
press: 1.00000 atm
elementType: 35 35 7 7 6 6 6 6 6 6 6 6 6 6 6 6 6 6 1 1 1 1 1 1 1 1 1 1 1 1 1 1 1 1 1 1
symmnumber: 1
zpe: 768577.3 jmol-1
zpe.correction: 0.292736 hartree
zpe.thermalcorrener: 0.310656 hartree
zpe.thermalcorrenthalpy: 0.311600 hartree
zpe.thermalcorrgfe: 0.243136 hartree
zpe.sumelectzpe: -679.319736 hartree
zpe.sumelectthermal: -679.301816 hartree
zpe.sumelectthermalent: -679.300871 hartree
zpe.sumelectthermalfe: -679.369335 hartree
dipole: 6.3597 -3.0933 0.8262
dipole: 7.1202
quadrupole: -118.7976 -127.9120 -126.8413
quadrupole: -11.2846 -1.0015 5.2791
quadrupole: 5.7193 -3.3950 -2.3243 -11.2846 -1.0015 5.2791
hfenergy: -679.6124713 hartree
pointgroup: C01 [X(C14H18Br2N2)]
dipole: -2.6456852 -0.9198688 0.0377699 debye
polarizability: 333.6139122|-2.4024174|173.8137294|7.9237804|-54.1133311|168.4888473 unknown
InChI: InChI=1S/C14H18Br2N2/c15-11-14(12-5-7-13(16)8-6-12)17-18-9-3-1-2-4-10-18/h5-8H,1-4,9-11H2
charge 0 multiplicity 1
36 atoms
Br 0.015313 3.082012 -2.087045
Br 6.16674 -0.692132 1.214975
N  -2.028674 0.421378 0.515031
N  -0.702927 0.196494 0.508949
C  -4.513635 -0.804121 -0.780367
C  -3.638234 -1.928632 -0.159526
C  -3.688885 0.339079 -1.428902
C  -3.169214 -1.700869 1.303484
C  -2.875849 1.203994 -0.433637
C  -2.746183 -0.243355 1.627415
C  0.202069 0.495364 -0.43672
C  1.619533 0.231428 -0.038685
C  -0.064872 0.965873 -1.816333
C  2.708467 0.75095 -0.792562
C  1.921751 -0.553475 1.111082
C  4.047693 0.484871 -0.428967
C  3.250999 -0.830293 1.484211
C  4.305808 -0.309134 0.703909
H  -5.151267 -1.246008 -1.570279
H  -5.210256 -0.391696 -0.02106
H  -4.192086 -2.886595 -0.192854
H  -2.749132 -2.068291 -0.806574
H  -3.012967 -0.108484 -2.185775
H  -4.365565 1.024097 -1.978018
H  -3.978681 -1.977611 2.008025
H  -2.320133 -2.379935 1.508938
H  -2.249477 1.944451 -0.956714
H  -3.583219 1.778742 0.195962
H  -3.640478 0.366923 1.849486
H  -2.08849 -0.225155 2.512645
H  0.705064 0.640782 -2.527881
H  -1.064396 0.735357 -2.201303
H  2.530037 1.402546 -1.654011
H  1.093493 -0.944871 1.707697
H  4.870422 0.900953 -1.017265
H  3.462531 -1.443136 2.365368
