program: Gaussian 09
title: 000284671
version: EM64L-G09RevD.01
frameworkgroup: C1[X(C15H16N2O6)]
method: RPBEPBE
basis: SDD
operation: Freq
keyword: #p
keyword: freq=noraman
keyword: PBEPBE/SDD
title: #p freq=noraman PBEPBE/SDD
converged: YES YES NO NO
title: Mulliken charges:
elementType: O O O O O O N N C C C C C C C C C C C C C C C H H H H H H H H H H H H H H H H
charge: -0.225196 -0.173462 -0.184638 -0.284771 -0.169378 -0.307237 -0.118646 -0.389402 -0.499886 -0.501132 0.212649 0.219654 -0.201209 0.284959 -0.655089 -0.477476 0.322596 0.468670 -0.387590 -0.367951 -0.225586 -0.228726 -0.232776 0.272586 0.271485 0.271035 0.273411 0.294703 0.235260 0.238372 0.249304 0.356360 0.245443 0.222752 0.233273 0.272713 0.227211 0.228187 0.229526
chargesum: 0.00000
title: Mulliken charges with hydrogens summed into heavy atoms:
elementType: O O O O O O N N C C C C C C C C C C C C C C C
charge: -0.225196 -0.173462 -0.184638 -0.284771 -0.169378 -0.307237 -0.118646 -0.033042 0.044185 0.043315 0.212649 0.219654 0.093495 0.284959 0.067847 -0.009282 0.322596 0.468670 -0.154318 -0.095238 0.001625 -0.000539 -0.003250
polarizability: 2.40355875e+02 -1.43455535e+01 1.82208770e+02 -1.16395079e+01 -1.31013213e+00 1.56063163e+02
1716.lowfreq: -8.2284 -4.8348 -0.0004 0.0001 0.0005 1.0930 6.2991 15.2152 21.8995
frequency: 4.1151 13.3179 21.5526 27.1757 37.5893 43.8315 50.9474 66.9634 79.0030 80.8823 107.7934 116.9079 150.2097 168.7904 193.8934 223.3742 248.5026 273.7097 310.9437 317.3263 348.2160 363.3657 383.3016 404.5557 407.6718 482.5013 505.0192 533.5768 546.4694 551.2702 561.8590 574.4448 596.6242 617.1881 620.3220 632.2925 655.0690 682.6100 698.4939 705.4857 734.8928 753.7744 760.0978 815.8580 818.2195 857.5740 860.6976 895.1274 934.6649 957.6692 978.5561 983.0285 988.8740 991.0066 998.8690 1000.7037 1005.9127 1017.3811 1027.7517 1034.4735 1075.6038 1090.9574 1125.2045 1147.5807 1164.1783 1173.3658 1181.2448 1188.9722 1207.8046 1208.9802 1222.0951 1231.3737 1239.5354 1282.6243 1292.9110 1294.7575 1321.4984 1330.2955 1350.7630 1382.7129 1385.7363 1437.0012 1442.8892 1452.9114 1461.8839 1465.7271 1467.6700 1484.4925 1487.2182 1594.6266 1614.8905 1647.2148 1664.4628 1704.6156 1734.5852 2999.1776 3030.5866 3037.9127 3039.2537 3050.9719 3085.5874 3102.4307 3106.4410 3112.1154 3113.7813 3119.8950 3127.8692 3140.0416 3150.8908 3164.7911 3575.1565
redmass: 6.3625 5.4386 4.6088 5.4163 5.7767 6.2121 5.1100 4.8504 2.6048 4.3932 7.3753 5.5616 5.3663 6.3058 3.0422 1.1926 6.1216 7.2418 9.3172 7.4502 2.9431 8.6336 3.8093 2.8468 3.3197 4.1458 5.2399 3.5566 3.3428 3.5971 4.7738 1.3193 3.9619 6.3207 5.3022 6.2402 5.9230 6.3455 7.0361 2.0145 4.5681 11.1823 2.2267 3.4815 1.4820 1.6006 2.8660 2.1830 1.4939 2.8079 1.9179 1.4607 4.1140 4.0892 2.8162 1.3359 2.1824 5.4923 2.2156 4.6847 2.6567 1.5198 3.7556 1.1950 11.4327 1.0545 2.8077 1.1325 2.1306 1.1204 2.8466 2.9394 1.1581 1.3452 2.2646 1.5030 1.2464 1.2570 1.2734 1.1868 8.0018 1.0735 2.1827 1.0895 1.1442 1.0953 1.0925 2.1238 1.7636 6.1101 6.0789 9.2643 12.6086 12.6295 12.2514 1.0340 1.0594 1.0586 1.0630 1.0847 1.1036 1.1019 1.1010 1.1073 1.1021 1.0866 1.0873 1.0921 1.0964 1.1016 1.0777
irintensity: 0.0437 0.1868 0.1707 0.4033 0.5327 2.5728 4.0818 3.8390 3.4619 4.5771 8.6980 0.8133 1.1292 1.6549 0.9212 1.3410 9.4985 8.5344 1.4637 3.4716 7.5056 22.8720 16.1915 0.3209 1.6576 10.8613 18.3426 0.1643 1.4752 3.1652 10.9223 141.0832 2.1812 0.8336 4.3449 51.4137 1.6578 20.5112 17.4510 67.2910 32.8224 33.8998 92.8523 9.7879 16.0148 19.3110 61.6012 4.6542 8.0989 55.7963 66.9395 18.1822 169.1540 118.1504 152.2694 0.3105 6.2019 10.3564 2.5420 25.8316 41.4284 9.2292 49.4051 1.0981 222.7939 0.0246 41.8550 4.5863 224.7118 3.3603 24.0188 74.6064 10.8536 17.1399 59.2071 3.7657 49.9658 2.0456 12.8925 19.6471 0.7594 1.0632 9.6520 26.7399 14.7375 82.9310 96.9537 32.2876 319.9752 2.1868 0.5473 257.2592 553.5810 83.4620 75.1254 8.8355 10.2710 33.2970 1.2327 12.3997 0.0530 4.4444 18.0484 4.8952 10.9193 5.6207 1.8299 19.0596 25.0737 23.1408 58.7855
temp: 298.150 k
press: 1.00000 atm
elementType: 8 8 8 8 8 8 7 7 6 6 6 6 6 6 6 6 6 6 6 6 6 6 6 1 1 1 1 1 1 1 1 1 1 1 1 1 1 1 1
symmnumber: 1
zpe: 773610.6 jmol-1
zpe.correction: 0.294653 hartree
zpe.thermalcorrener: 0.317098 hartree
zpe.thermalcorrenthalpy: 0.318042 hartree
zpe.thermalcorrgfe: 0.235724 hartree
zpe.sumelectzpe: -1140.342864 hartree
zpe.sumelectthermal: -1140.320419 hartree
zpe.sumelectthermalent: -1140.319474 hartree
zpe.sumelectthermalfe: -1140.401793 hartree
dipole: 1.9752 -0.7941 2.9464
dipole: 3.6350
quadrupole: -94.8113 -134.2526 -139.7998
quadrupole: -7.4019 1.2391 -7.1414
quadrupole: 28.1433 -11.2981 -16.8452 -7.4019 1.2391 -7.1414
hfenergy: -1140.6375168 hartree
pointgroup: C01 [X(C15H16N2O6)]
dipole: -0.7907788 -1.0720578 -0.5201991 debye
polarizability: 237.9174436|1.7439766|169.6842654|-22.2610375|-13.5664181|171.0260992 unknown
InChI: InChI=1S/C15H16N2O6/c1-10(14(20)23-17-12(18)7-8-13(17)19)16-15(21)22-9-11-5-3-2-4-6-11/h2-6,10,16H,7-9H2,1H3
charge 0 multiplicity 1
39 atoms
O  -2.427136 -0.249017 0.077364
O  -3.755477 -0.917107 2.582001
O  -4.372178 -0.27005 -2.046894
O  2.034059 -0.55041 0.975665
O  -3.100971 2.010526 0.288308
O  1.846348 1.806003 0.883366
N  -3.799538 -0.583477 0.231092
N  0.147997 0.377539 0.121643
C  -5.840369 -1.211827 1.208852
C  -6.052956 -0.970142 -0.311394
C  -4.367217 -0.900996 1.498442
C  -4.689984 -0.564825 -0.878257
C  -0.743681 1.465008 -0.285268
C  -2.196608 1.197795 0.090503
C  -0.68898 1.756131 -1.815276
C  3.423089 -0.40634 1.536714
C  1.380469 0.652933 0.67363
C  4.469521 -0.395719 0.443585
C  5.101065 -1.599976 0.041686
C  4.833373 0.821544 -0.189864
C  6.077868 -1.592841 -0.979169
C  5.808985 0.829573 -1.210993
C  6.433742 -0.376664 -1.607621
H  -6.465957 -0.558618 1.839736
H  -6.046616 -2.25296 1.510622
H  -6.411392 -1.865725 -0.846347
H  -6.769951 -0.157345 -0.517364
H  -0.423449 2.371289 0.258504
H  -1.013338 0.875124 -2.395085
H  -1.340496 2.608971 -2.072583
H  0.350175 2.006017 -2.085742
H  -0.131731 -0.595382 -0.008662
H  3.447459 0.520241 2.135447
H  3.515721 -1.29015 2.187013
H  4.825147 -2.543656 0.528533
H  4.337749 1.749472 0.117145
H  6.561676 -2.528525 -1.28103
H  6.085008 1.773604 -1.69403
H  7.193275 -0.368818 -2.39767
