program: Gaussian 09
title: 000284666
version: EM64L-G09RevD.01
frameworkgroup: C1[X(C15H11Br2NO2)]
method: RPBEPBE
basis: SDD
operation: Freq
keyword: #p
keyword: freq=noraman
keyword: PBEPBE/SDD
title: #p freq=noraman PBEPBE/SDD
converged: YES YES NO NO
title: Mulliken charges:
elementType: Br Br O O N C C C C C C C C C C C C C C C H H H H H H H H H H H
charge: 0.003315 0.029107 -0.242202 -0.263236 -0.411470 0.478505 -0.635865 0.223898 0.385513 0.129488 0.013631 -0.404514 -0.556037 -0.308148 -0.333431 0.351740 -0.397765 -0.169842 -0.224487 -0.534783 0.248472 0.258072 0.311839 0.246766 0.297361 0.279044 0.246677 0.276319 0.227184 0.226675 0.248175
chargesum: 0.00000
title: Mulliken charges with hydrogens summed into heavy atoms:
elementType: Br Br O O N C C C C C C C C C C C C C C C
charge: 0.003315 0.029107 -0.242202 -0.263236 -0.099632 0.478505 -0.129321 0.223898 0.385513 0.129488 0.013631 -0.404514 -0.309271 -0.010787 -0.054387 0.351740 -0.151089 0.106477 -0.224487 0.167251
polarizability: 3.41751774e+02 -1.08129271e+00 2.35847221e+02 -4.89741997e+00 -1.52620702e+01 1.12583576e+02
1716.lowfreq: -6.0498 -3.8923 -1.4695 -0.0008 -0.0007 -0.0006 24.0738 37.2013 72.2217
frequency: 24.0600 37.1805 72.2208 80.9235 107.5747 113.1957 118.5372 159.4331 172.1699 188.4142 214.1379 217.5492 245.6575 272.9869 284.9787 314.7899 320.5264 344.4941 372.1329 375.5293 420.6503 445.4786 458.7970 477.8101 528.4559 538.9945 572.4514 573.2796 625.7251 632.9631 657.0354 691.0465 714.8865 722.2023 735.9915 770.8652 808.3799 827.5430 850.0338 875.6956 891.8292 910.2544 930.2512 977.3766 981.6558 1002.6717 1062.8351 1093.0500 1110.7603 1119.7090 1135.3763 1153.9179 1193.3857 1194.1204 1210.9204 1243.2671 1262.6968 1281.9972 1292.7592 1353.9175 1363.0809 1378.5658 1395.8662 1418.6346 1428.9622 1437.7654 1458.0082 1468.2948 1471.4309 1486.2485 1505.2225 1514.5386 1547.0670 1560.5469 1579.0310 1631.1419 2960.8584 2969.8853 3062.3581 3091.2034 3130.9418 3145.6801 3151.8584 3174.3722 3180.3296 3185.1295 3570.8467
redmass: 7.8531 7.4536 4.4526 4.6902 16.8473 6.9369 10.9019 5.5149 4.9678 4.7717 5.7426 1.2453 5.3219 4.8952 4.8302 4.5328 4.1496 4.0020 6.1300 4.9214 1.4067 3.4152 6.1534 3.9407 5.4519 4.5118 5.0504 5.0752 5.5487 4.2474 4.7223 4.0048 6.1519 7.2571 4.8376 2.9887 1.8732 5.3602 1.7838 1.4476 5.1151 1.6589 3.7891 1.7909 1.6017 4.6305 3.6838 2.1774 1.2564 2.8092 1.7892 1.4392 2.0730 1.7643 2.3147 1.7018 3.1356 1.4957 1.9565 1.3423 5.3826 3.5780 2.0275 4.2387 3.3094 1.3023 1.1977 1.0503 1.0593 2.7095 6.7817 2.7177 8.3238 5.4854 7.9460 6.6924 1.0697 1.0324 1.1045 1.0926 1.1002 1.0914 1.0878 1.0959 1.0925 1.0936 1.0775
irintensity: 1.1149 0.5231 2.0725 0.3014 2.1836 1.2151 3.3126 3.7614 2.6297 0.3276 1.1549 0.1291 1.7905 3.8073 2.5285 0.4051 11.8525 7.7378 6.7385 8.1546 66.2542 1.4740 27.7107 6.4002 3.2928 12.5118 42.4770 7.5374 14.0105 17.4987 4.4436 21.3661 7.2390 32.5644 14.6338 34.1390 6.7750 44.4465 60.6789 17.8818 0.1937 8.7183 9.0331 7.7355 9.4128 64.9779 27.2120 6.6394 0.1728 6.9929 114.4281 75.9985 68.9789 111.8608 6.5182 51.7055 473.4414 21.9611 14.0366 52.5070 2.8833 29.7233 39.4550 10.6345 34.7946 9.1276 24.6503 16.5113 60.5572 64.6144 216.7965 118.7323 70.7289 74.8735 19.8697 488.5921 30.9108 78.5985 41.2818 5.4645 24.1807 4.3939 0.7874 13.8897 2.9511 0.0356 38.1109
temp: 298.150 k
press: 1.00000 atm
elementType: 35 35 8 8 7 6 6 6 6 6 6 6 6 6 6 6 6 6 6 6 1 1 1 1 1 1 1 1 1 1 1
symmnumber: 1
zpe: 583989.4 jmol-1
zpe.correction: 0.222430 hartree
zpe.thermalcorrener: 0.240440 hartree
zpe.thermalcorrenthalpy: 0.241384 hartree
zpe.thermalcorrgfe: 0.174250 hartree
zpe.sumelectzpe: -808.903976 hartree
zpe.sumelectthermal: -808.885966 hartree
zpe.sumelectthermalent: -808.885022 hartree
zpe.sumelectthermalfe: -808.952156 hartree
dipole: 4.1473 2.5997 -1.4549
dipole: 5.1064
quadrupole: -107.2855 -131.6424 -141.2054
quadrupole: -6.8038 -2.8390 5.4679
quadrupole: 19.4256 -4.9313 -14.4943 -6.8038 -2.8390 5.4679
hfenergy: -809.1264059 hartree
pointgroup: C01 [X(C15H11Br2N1O2)]
dipole: 1.639441 1.1135385 -0.3292868 debye
polarizability: 341.5011592|0.921404|237.6893813|9.0039966|1.8790245|110.9920313 unknown
InChI: InChI=1S/C15H11Br2NO2/c1-20-9-2-3-10-14(6-9)18-7-12-11(15(10)19)4-8(16)5-13(12)17/h2-6,18H,7H2,1H3
charge 0 multiplicity 1
31 atoms
Br -3.55583 3.189508 -0.011423
Br -5.033476 -2.225099 -1.384903
O  -0.29317 -2.3402 1.324136
O  4.92546 0.624564 -0.93134
N  0.440194 1.817476 0.166882
C  -1.81035 0.837148 0.405487
C  -0.752532 1.739706 1.013225
C  -1.524165 -0.555361 0.332218
C  1.37628 0.794471 0.078492
C  1.105631 -0.554627 0.523921
C  -0.221129 -1.172437 0.810798
C  -3.06496 1.277943 -0.074436
C  2.668007 1.120782 -0.419207
C  -2.483718 -1.464314 -0.182146
C  2.20814 -1.464578 0.556331
C  3.706143 0.174061 -0.419612
C  3.487984 -1.136361 0.10213
C  -4.029086 0.398379 -0.608103
C  -3.713371 -0.976067 -0.65056
C  6.063305 -0.303038 -0.917332
H  -1.143542 2.758244 1.159757
H  -0.467264 1.3419 2.009715
H  0.676633 2.718364 -0.247599
H  2.889423 2.135478 -0.767204
H  -2.244336 -2.53033 -0.189259
H  1.992696 -2.474662 0.91945
H  4.285385 -1.883426 0.123999
H  -4.991387 0.769025 -0.96778
H  5.858295 -1.196824 -1.536305
H  6.316629 -0.611189 0.11469
H  6.898006 0.266064 -1.351322
