program: Gaussian 09
title: 000284651
version: EM64L-G09RevD.01
frameworkgroup: C1[X(C17H25NO)]
method: RPBEPBE
basis: SDD
operation: Freq
keyword: #p
keyword: freq=noraman
keyword: PBEPBE/SDD
title: #p freq=noraman PBEPBE/SDD
converged: YES YES NO NO
title: Mulliken charges:
elementType: O N C C C C C C C C C C C C C C C C C H H H H H H H H H H H H H H H H H H H H H H H H H
charge: -0.248244 -0.148183 -0.370627 -0.386111 -0.381899 -0.367709 -0.532322 -0.695091 0.168713 -0.333254 0.519216 0.402206 -0.290358 -0.419141 -0.402200 -0.370140 -0.357044 -0.645036 -0.646878 0.192015 0.184455 0.189989 0.195972 0.209512 0.227465 0.193743 0.214200 0.224699 0.225896 0.218612 0.213270 0.206919 0.212536 0.267386 0.233650 0.225332 0.239022 0.237191 0.238903 0.219046 0.238476 0.237856 0.238204 0.219753
chargesum: 0.00000
title: Mulliken charges with hydrogens summed into heavy atoms:
elementType: O N C C C C C C C C C C C C C C C C C
charge: -0.248244 -0.148183 0.005842 -0.000150 0.055078 0.040234 -0.081727 -0.056289 0.168713 -0.120718 0.519216 0.402206 -0.022972 -0.185491 -0.176867 -0.131118 -0.119853 0.051389 0.048935
polarizability: 4.28980087e+02 1.28727810e+01 1.80065237e+02 1.36732944e+01 4.42523174e-01 1.21203680e+02
1716.lowfreq: -6.7385 -4.0647 -0.0008 -0.0005 0.0022 7.7731 17.0979 20.1292 36.4538
frequency: 16.3319 20.0115 35.9870 42.4779 52.7987 70.8086 79.0807 90.4695 98.5593 111.2956 134.1089 158.6823 171.0911 176.7891 194.1215 198.1524 246.4640 257.2017 257.8712 298.5496 304.7400 364.5060 380.4641 402.9530 425.2772 450.1362 481.5620 508.4049 518.1177 530.1622 553.7361 634.4373 658.3167 710.2512 724.0650 736.3289 753.9864 798.5095 805.8793 820.6194 829.6312 847.4242 857.5065 886.5045 922.6890 940.8519 949.6396 960.3638 965.1908 993.7348 996.2660 1003.8649 1011.5525 1055.2655 1059.4908 1088.6592 1090.8928 1105.3715 1110.5126 1117.2371 1130.2877 1136.0656 1153.1012 1165.7124 1198.2914 1224.2533 1230.7552 1248.1249 1257.2321 1259.3015 1279.9122 1292.1468 1296.7002 1311.6952 1330.1404 1335.9849 1347.2754 1349.8615 1360.5129 1370.2432 1381.6801 1388.1708 1429.5949 1431.4725 1450.1618 1458.0741 1458.5214 1464.5842 1466.1839 1474.7098 1476.2085 1476.7880 1482.5930 1491.4645 1493.4359 1504.7434 1529.5890 1548.1992 1551.3157 1628.0215 1640.1069 2945.2646 2945.3395 2951.5605 2952.5302 2961.2283 2973.0627 2980.2609 2987.7987 2993.2191 2999.1209 3013.4064 3014.4989 3016.0814 3029.7682 3056.1505 3067.8519 3073.6688 3086.2101 3098.7624 3109.2966 3110.5736 3123.5620 3133.4521 3164.7973 3168.6927
redmass: 4.4667 3.1370 3.6634 3.5023 5.4152 2.6547 2.5510 1.9445 3.0514 1.9662 2.1914 2.0484 2.3827 2.4605 1.2144 2.6606 3.0492 1.5036 2.2794 3.9644 3.0679 2.6083 3.4433 2.7471 2.9010 3.3690 2.8690 2.3210 2.8399 4.0586 2.2596 7.0036 5.2957 1.1942 4.2382 2.5488 1.4126 2.0298 1.2930 1.8187 3.7458 1.6113 1.6223 1.6891 4.1438 3.0860 1.3636 1.3542 1.7890 2.8823 2.0156 1.6215 1.2505 1.5061 2.8165 1.6451 1.6730 1.2374 1.3264 1.9750 1.5339 2.3189 1.6321 1.6857 1.1630 1.3677 1.3669 1.3117 2.8125 1.3210 1.1050 1.1725 1.5864 1.5592 1.4343 1.7053 1.6015 1.4485 1.6472 3.5615 4.0839 1.2239 1.2324 1.1024 2.5895 1.0777 1.2874 1.0403 1.0835 1.0478 1.0814 1.0457 1.0743 1.1097 1.0687 1.1257 2.7701 6.2457 6.5969 5.8754 5.8486 1.0368 1.0599 1.0593 1.0393 1.0607 1.0369 1.0616 1.0862 1.0728 1.0976 1.0994 1.0995 1.1030 1.1000 1.1021 1.0994 1.0997 1.0893 1.0967 1.0945 1.0897 1.0894 1.0879 1.0934 1.0943
irintensity: 0.9601 0.1532 0.7870 1.1397 0.3337 0.9720 1.0932 0.2302 0.9939 5.1017 0.0937 0.0374 1.3895 0.6973 0.2049 2.2937 0.4892 0.5172 1.4905 9.7696 0.4582 5.4767 3.2974 0.4033 0.2882 3.8668 5.3338 11.7177 1.6082 22.6326 6.9431 0.4220 10.7107 14.4133 4.2131 3.0835 9.1942 4.6528 0.6385 80.1284 5.6649 1.6547 2.0531 8.8410 10.5532 26.8472 2.0112 0.0637 9.0307 5.4488 10.4405 26.6522 31.0094 24.8758 52.6022 9.2948 163.6604 0.0276 1.0417 2.7766 5.2803 131.3059 5.7004 1.6461 140.1249 16.4020 12.7871 4.5482 25.3278 17.4262 1.9897 5.8044 21.0400 17.1973 9.1558 79.4484 44.8628 8.5587 5.3861 184.7375 43.8670 17.3518 15.2470 15.5605 48.0453 5.8120 23.8004 0.0061 1.8812 1.6171 19.5526 23.2895 27.1003 7.7271 3.7754 49.2062 675.8654 252.3114 268.7973 587.9375 22.0060 91.1337 31.9742 41.2325 142.5705 49.6379 37.5688 25.7174 22.2548 22.3686 16.0127 1.8119 46.1600 80.1095 57.3161 68.0235 63.5688 86.2258 0.9300 4.1191 46.9676 13.8307 10.2251 7.2702 25.4613 15.1584
temp: 298.150 k
press: 1.00000 atm
elementType: 8 7 6 6 6 6 6 6 6 6 6 6 6 6 6 6 6 6 6 1 1 1 1 1 1 1 1 1 1 1 1 1 1 1 1 1 1 1 1 1 1 1 1 1
symmnumber: 1
zpe: 996042.7 jmol-1
zpe.correction: 0.379373 hartree
zpe.thermalcorrener: 0.400932 hartree
zpe.thermalcorrenthalpy: 0.401876 hartree
zpe.thermalcorrgfe: 0.325574 hartree
zpe.sumelectzpe: -791.310814 hartree
zpe.sumelectthermal: -791.289254 hartree
zpe.sumelectthermalent: -791.288310 hartree
zpe.sumelectthermalfe: -791.364613 hartree
dipole: 7.1030 3.3197 0.4966
dipole: 7.8562
quadrupole: -71.3904 -113.3231 -121.2860
quadrupole: -3.5346 2.1994 -1.1390
quadrupole: 30.6094 -11.3233 -19.2861 -3.5346 2.1994 -1.1390
hfenergy: -791.6901864 hartree
pointgroup: C01 [X(C17H25N1O1)]
dipole: -2.7879231 1.3245729 -0.1625098 debye
polarizability: 428.8638629|-14.4612162|180.1962845|13.0781554|0.8604657|121.1888567 unknown
InChI: InChI=1S/C17H25NO/c1-4-5-6-7-8-17(19)14-11-15-9-12-16(13-10-15)18(2)3/h9-14H,4-8H2,1-3H3
charge 0 multiplicity 1
44 atoms
O  2.232194 -1.672815 0.278853
N  -6.107041 0.452283 -0.234736
C  5.58941 1.138864 0.404145
C  7.022169 0.603055 0.653525
C  4.497149 0.046784 0.439524
C  7.531825 -0.43165 -0.382787
C  3.079651 0.628554 0.302538
C  7.60915 0.115038 -1.826075
C  1.966073 -0.427767 0.257989
C  0.581516 0.091533 0.181664
C  -1.914429 -0.408171 0.032638
C  -4.744788 0.168935 -0.144285
C  -0.501192 -0.754611 0.114935
C  -2.888435 -1.447853 -0.046865
C  -2.403432 0.93357 0.02474
C  -4.26187 -1.180778 -0.133478
C  -3.77041 1.221462 -0.059592
C  -7.082815 -0.642373 -0.333366
C  -6.574365 1.845741 -0.238967
H  5.551764 1.667435 -0.570816
H  5.362386 1.904908 1.1753
H  7.727025 1.460455 0.67306
H  7.058008 0.143352 1.663034
H  4.566487 -0.525083 1.385627
H  4.656513 -0.692462 -0.367168
H  8.539987 -0.771598 -0.071144
H  6.885191 -1.330648 -0.363427
H  2.862353 1.329283 1.137132
H  3.002383 1.243552 -0.620864
H  6.608246 0.373533 -2.217451
H  8.050675 -0.631894 -2.511452
H  8.234111 1.027649 -1.870612
H  0.460097 1.183032 0.176637
H  -0.256837 -1.828342 0.123531
H  -2.547963 -2.49097 -0.041275
H  -1.695151 1.76753 0.087019
H  -4.961688 -2.018604 -0.192597
H  -4.090651 2.267068 -0.060827
H  -6.901478 -1.272122 -1.227443
H  -8.097513 -0.222619 -0.414493
H  -7.055805 -1.299401 0.559345
H  -6.165063 2.414234 -1.098312
H  -6.288948 2.37774 0.690812
H  -7.672692 1.863072 -0.314208
