program: Gaussian 09
title: 000284650
version: EM64L-G09RevD.01
frameworkgroup: C1[X(C15H18Cl2O)]
method: RPBEPBE
basis: SDD
operation: Freq
keyword: #p
keyword: freq=noraman
keyword: PBEPBE/SDD
title: #p freq=noraman PBEPBE/SDD
converged: YES YES NO NO
title: Mulliken charges:
elementType: Cl Cl O C C C C C C C C C C C C C C C H H H H H H H H H H H H H H H H H H
charge: -0.042412 -0.028600 -0.221143 -0.357059 -0.353091 -0.376674 -0.356066 -0.540186 -0.696292 0.171165 -0.302380 -0.214815 0.651659 -0.302139 -0.304441 -0.244336 -0.245973 -0.214020 0.183062 0.184511 0.190528 0.189602 0.217641 0.214155 0.193357 0.193886 0.236842 0.234506 0.210427 0.214773 0.210593 0.250524 0.275523 0.264387 0.266020 0.246467
chargesum: 0.00000
title: Mulliken charges with hydrogens summed into heavy atoms:
elementType: Cl Cl O C C C C C C C C C C C C C C C
charge: -0.042412 -0.028600 -0.221143 0.010514 0.027038 0.055122 0.031177 -0.068838 -0.060499 0.171165 -0.051856 0.060708 0.651659 -0.302139 -0.304441 0.020051 0.020048 0.032447
polarizability: 3.05649266e+02 1.76476992e+00 1.95569371e+02 9.52932328e+00 2.54696353e+00 1.01181357e+02
1716.lowfreq: -2.8902 -0.0017 -0.0016 -0.0002 2.4813 4.8286 16.1419 30.3193 34.0978
frequency: 15.6429 30.2342 33.6764 50.5122 55.9772 71.7408 85.5698 111.8937 125.2056 131.0825 145.8188 165.4332 175.8082 190.1933 222.6238 228.5761 246.8272 284.2478 304.6119 342.5900 368.7511 394.9160 426.8814 451.3836 495.5704 524.9205 538.4617 553.8654 592.3801 696.6609 714.0673 722.8353 727.3110 736.6814 778.2840 788.9382 829.5066 862.5084 889.9544 897.8754 899.6044 926.3173 969.3140 977.7458 1009.1221 1015.9029 1024.5812 1044.8062 1070.4974 1072.4234 1082.2623 1093.3032 1095.8042 1131.4107 1145.6840 1176.6733 1190.3740 1229.0355 1234.4117 1237.2197 1275.4718 1277.4190 1286.4963 1292.9726 1299.1487 1323.4274 1335.5674 1356.8675 1360.8087 1364.1281 1390.9019 1414.4463 1426.0506 1427.4702 1462.0402 1464.9058 1472.2409 1476.8685 1481.0714 1489.0414 1549.9347 1566.4060 1586.4351 1646.8231 2945.7160 2949.4847 2957.0293 2967.4114 2972.2712 2986.2653 2988.5757 2992.7424 3003.3386 3029.6757 3054.6887 3068.6103 3070.8477 3106.0091 3155.6355 3173.0865 3175.8943 3186.9642
redmass: 6.5462 5.7805 3.2323 5.5537 1.8927 3.5805 3.4705 1.8152 4.2228 3.8300 2.3009 3.1401 4.8123 4.4752 11.3301 1.1330 7.7850 5.0222 3.9797 4.2403 9.9142 7.5683 4.2273 3.3823 2.7904 5.4630 4.5518 2.6750 7.5345 5.5480 1.5573 1.5123 5.8912 1.2885 1.3778 1.3586 5.1611 1.4806 1.9069 1.6127 1.3521 4.7266 1.3421 1.2477 3.3748 1.1352 4.1578 5.8413 2.7975 2.4038 2.1698 1.5430 1.7147 2.7146 1.7664 1.2622 1.6680 1.5779 1.6577 1.3368 1.1662 1.3009 1.0886 1.0989 1.6398 1.6716 1.6014 1.6596 2.0270 2.1984 1.2182 2.5071 2.6841 1.1368 1.0727 1.0736 1.0717 1.0425 1.0773 1.0891 6.3182 8.1324 7.6474 5.8969 1.0602 1.0592 1.0589 1.0591 1.0364 1.0965 1.0974 1.0603 1.1014 1.1041 1.1031 1.1005 1.0994 1.0874 1.0877 1.0916 1.0931 1.0998
irintensity: 1.8894 0.5056 2.4981 0.1472 0.3723 0.2068 0.9425 0.1410 0.2013 0.1708 0.4208 1.0649 1.0053 0.0351 0.7833 0.0158 6.4512 0.0463 4.9896 2.0938 11.0699 7.1118 7.6803 1.4310 0.1310 0.9749 0.8285 0.9375 10.8124 7.8221 0.8763 39.2277 53.3076 2.8565 60.2265 1.7210 5.8119 1.2674 3.9438 3.1347 0.0114 7.0809 1.1039 4.2419 29.6815 41.8869 46.3219 0.6443 0.9284 0.5934 5.7926 18.8288 31.8359 78.9017 17.8520 12.6018 0.0431 12.4243 10.4339 0.9044 1.4260 12.0915 0.2018 2.0658 117.3185 7.8685 35.4605 5.7341 8.6919 63.6101 10.6670 61.6469 19.4669 28.8033 0.5211 0.6231 3.1538 12.3158 2.8175 22.0399 41.8821 183.5116 5.2465 77.2904 24.4802 19.2079 5.9547 89.7104 38.5207 8.8126 2.8469 30.1023 0.5610 36.8263 65.5907 97.2309 57.2681 0.5931 2.1241 1.8119 0.8321 6.7253
temp: 298.150 k
press: 1.00000 atm
elementType: 17 17 8 6 6 6 6 6 6 6 6 6 6 6 6 6 6 6 1 1 1 1 1 1 1 1 1 1 1 1 1 1 1 1 1 1
symmnumber: 1
zpe: 756325.2 jmol-1
zpe.correction: 0.288069 hartree
zpe.thermalcorrener: 0.307920 hartree
zpe.thermalcorrenthalpy: 0.308864 hartree
zpe.thermalcorrgfe: 0.235921 hartree
zpe.sumelectzpe: -1576.373938 hartree
zpe.sumelectthermal: -1576.354087 hartree
zpe.sumelectthermalent: -1576.353143 hartree
zpe.sumelectthermalfe: -1576.426086 hartree
dipole: 2.5420 3.0197 1.2145
dipole: 4.1298
quadrupole: -94.9970 -127.2294 -124.5278
quadrupole: 0.3444 0.9388 -1.4695
quadrupole: 20.5878 -11.6447 -8.9431 0.3444 0.9388 -1.4695
hfenergy: -1576.6620071 hartree
pointgroup: C01 [X(C15H18Cl2O1)]
dipole: -1.0321622 0.6069317 -1.0982481 debye
polarizability: 305.4746739|8.322948|157.2750113|7.8853279|-46.3250713|139.6503086 unknown
InChI: InChI=1S/C15H18Cl2O/c1-2-3-4-5-7-12(18)10-11-13-14(16)8-6-9-15(13)17/h6,8-11H,2-5,7H2,1H3
charge 0 multiplicity 1
36 atoms
Cl -2.452404 2.164223 -1.562141
Cl -3.509288 -2.419056 1.625911
O  0.979007 -0.92917 1.490058
C  4.669859 0.330987 -0.526711
C  6.022334 -0.12183 0.068079
C  3.455453 -0.190343 0.272569
C  7.243789 0.38882 -0.729681
C  2.112657 0.244495 -0.338261
C  8.590156 -0.075523 -0.133266
C  0.883149 -0.254733 0.421108
C  -0.441305 0.105617 -0.176334
C  -1.597512 -0.339421 0.405757
C  -3.000229 -0.147018 0.014017
C  -3.528049 0.878361 -0.833968
C  -3.998804 -1.037521 0.535638
C  -4.894519 1.009815 -1.141401
C  -5.369505 -0.941856 0.245645
C  -5.820148 0.092212 -0.601887
H  4.600066 -0.01886 -1.578701
H  4.641415 1.440611 -0.566088
H  6.098305 0.229544 1.118338
H  6.050904 -1.23072 0.110128
H  3.510448 0.162915 1.320226
H  3.486831 -1.295721 0.328636
H  7.163792 0.040658 -1.780065
H  7.217191 1.497261 -0.767183
H  2.048761 1.353233 -0.396765
H  2.029352 -0.102339 -1.391219
H  8.653388 -1.179952 -0.110733
H  9.446768 0.300177 -0.72281
H  8.709737 0.287014 0.905289
H  -0.427462 0.707129 -1.088775
H  -1.446048 -0.972385 1.291612
H  -5.226275 1.823524 -1.791465
H  -6.068973 -1.663881 0.674118
H  -6.884444 0.184635 -0.837976
